{"text_format":"3","workbook":"xlsx","n_sheets":17,"sheets":["P-Fraktionierung","Fällmittel","ÜbersichtMessSteuerRegeltechnik","MST Listen","Pges_Betriebsmittelwert","Vorlage 2h Fracht","Vorlage k24h Fracht","Vorlage Überschreitg","Vorlage Fremdwasser","Prüfergebnis Durchflussmessung","JSM Eingabe+TW","JSM Dichtemittel ","JSM GM A198","JSM Jahresdauerlinie","JSM FW Dreieck","JSM Fremdwasser","JSM Ergebnis"],"not_rendered":{"charts":4,"images":4,"defined_names":11,"comments":8},"read":"whole","date_system":"1900"}

{"sheet":"P-Fraktionierung","index":0,"n_rows":83,"n_cols":21,"rows_kept":83,"merged":[[1,2,1,20],[2,2,2,4],[2,5,2,9],[2,10,2,20],[3,2,3,4],[3,5,3,9],[3,10,3,20],[5,2,5,4],[5,5,5,9],[5,10,5,20],[6,2,6,4],[6,5,6,9],[7,2,7,4],[7,5,7,9],[7,10,7,20],[8,2,8,4],[8,5,8,9],[8,10,8,20],[10,2,10,20],[11,4,11,9],[11,10,11,20],[12,4,12,9],[12,10,12,20],[13,4,13,9],[13,10,13,20],[14,4,14,9],[14,10,14,20],[15,6,15,9],[16,2,16,3],[16,6,16,9],[16,10,16,20],[17,2,17,3],[17,6,17,9],[17,10,17,20],[18,2,18,3],[18,6,18,9],[18,10,18,20],[19,2,19,3],[19,6,19,9],[19,10,19,20],[20,2,20,3],[20,6,20,9],[20,10,20,20],[21,2,21,3],[21,6,21,9],[21,10,21,20],[22,2,22,3],[22,6,22,9],[22,10,22,20],[24,2,24,20],[32,4,33,4],[32,5,32,16],[32,17,32,19],[35,2,38,2],[35,3,38,3],[35,4,38,4],[35,5,38,5],[35,6,38,6],[35,17,38,17],[35,20,38,20],[39,2,42,2],[39,3,42,3],[39,4,42,4],[39,5,42,5],[39,6,42,6],[39,17,42,17],[39,20,42,20],[43,2,46,2],[43,3,46,3],[43,4,46,4],[43,5,46,5],[43,6,46,6],[43,17,46,17],[43,20,46,20],[47,2,50,2],[47,3,50,3],[47,4,50,4],[47,5,50,5],[47,6,50,6],[47,17,50,17],[47,20,50,20],[51,2,54,2],[51,3,54,3],[51,4,54,4],[51,5,54,5],[51,6,54,6],[51,17,54,17],[51,20,54,20],[55,2,58,2],[55,3,58,3],[55,4,58,4],[55,5,58,5],[55,6,58,6],[55,17,58,17],[55,20,58,20],[59,2,62,2],[59,3,62,3],[59,4,62,4],[59,5,62,5],[59,6,62,6],[59,17,62,17],[59,20,62,20],[63,2,66,2],[63,3,66,3],[63,4,66,4],[63,5,66,5],[63,6,66,6],[63,17,66,17],[63,20,66,20],[67,2,70,2],[67,3,70,3],[67,4,70,4],[67,5,70,5],[67,6,70,6],[67,17,70,17],[67,20,70,20],[71,2,74,2],[71,3,74,3],[71,4,74,4],[71,5,74,5],[71,6,74,6],[71,17,74,17],[71,20,74,20],[75,2,78,2],[75,3,78,3],[75,4,78,4],[75,5,78,5],[75,6,78,6],[75,17,78,17],[75,20,78,20],[79,2,82,2],[79,3,82,3],[79,4,82,4],[79,5,82,5],[79,6,82,6],[79,17,82,17],[79,20,82,20]]}
[]
[null,null,"Allgemeine Daten"]
[null,null,"Datenfeld",null,null,"Wert",{"$nulls":4},"Erläuterung"]
[null,null,"Kläranlage"]
[null,null,"Art der Phosphorelimination",{"$nulls":7},"Vor-, Simultanfällung oder/und Nachfällung, Bio-P etc. (Bitte auch Kombinationen angeben)"]
[null,null,"Ansprechpartner"]
[null,null,"Telefon"]
[null,null,"Probennahme",{"$nulls":7},"händig mit Schöpfkelle (Eintrag: händig) oder automatisch mit Probenahmegerät (Eintrag: automatisch)"]
[null,null,"Probenart",{"$nulls":7},"Stichprobe (Eintrag: Stp) oder qualifizierte Stichprobe (Eintrag: qStp)"]
[]
[null,null,"Daten zur P-Fällung"]
[null,null,"Datenfeld",null,"Wert",{"$nulls":5},"Erläuterung"]
[null,null,"Küvettentest",{"$nulls":7},"siehe Nr. 3 der Analyseanleitung; Angabe der Produktbezeichnung (z.B. LCK 348) bzw. Produktnummer (z.B. 114546)"]
[null,null,"Filter",{"$nulls":7},"Angabe Produktbezeichnung oder Produktnummer"]
[null,null,"Art des Fällmittels",{"$nulls":7},"Bitte Produktbezeichnung aus Tabellenblatt Fällmittel eintragen"]
[null,null,"Datenfeld",null,"Einheit",null,"Wert"]
[null,null,"WSmMe",null,"[mol/kg]"]
[null,null,"ρFML",null,"[kg/L]"]
[null,null,"Qd,FM",null,"[L/d]"]
[null,null,"βFäll",null,"[mol/L]"]
[null,null,"CP,Z",null,"[g/m³]",{"$nulls":5},"Mittlere Pges-Zulaufkonzentration des Jahres 2020 im Zulauf (Messwerte der Selbstüberwachung)"]
[null,null,"Qd",null,"[m³/d]",{"$nulls":5},"Mittlerer Tagesabfluss des Jahres 2020 im Ablauf (Messwerte der Selbstüberwachung)"]
[null,null,"FMd",null,"[mol Me/d]"]
[]
[null,null,"Messwerte"]
[null,null,"Erläuterungen"]
[null,null,"WS = Wetterschlüssel : trocken = 1; Frost = 2; Regen = 3; Gewitter = 4; Schneeschmelze = 5; Schneefall = 6; Regennachlauf = 7; Hochwassereinfluss = 8"]
[null,null,"C = Konzentration in der homogensierten Probe, S = Konzentration in der filtrierten Probe, X = Konzentration der partikulären Fraktion"]
[null,null,"CP = Gesamtphosphor; SP = gelöster Phosphor;  SPO4-P = Orthophosphat-Phosphor; XP = partikulärer Phosphor; GUP = unreaktiven Phosphor"]
[null,null,"Qh, korres, Qd, korres: Wenn Zulaufmengenmessung vorhanden, korrespondierend zur Ablaufmessung"]
[null,null,"CP,korres: Probenahme im Zulauf als qualifizierte Stichprobe korrespondierend zur Probenahme im Ablauf"]
[]
[{"$nulls":4},"WS","Ablauf",{"$nulls":11},"Zulauf"]
[null,null,"Datum","Uhrzeit",null,"Qh","Qd","Nr","CP","SP","SPO4-P","XP","GUP ","CCSB","XAFS","SNH4-N","CTNb","Qh, korres","Qd, korres","CP_korres","Bemerkung (Störstoffe, Eigenfärbung etc.)"]
[null,null,"[-]","[-]","[-]","[m³/h]","[m³/d]",null,"[mg/L]","[mg/L]","[mg/L]","[mg/L]","[mg/L]","[mg/L]","[mg/L]","[mg/L]","[mg/L]","[m³/h]","[m³/d]","[mg/L]","[-]"]
[{"$nulls":7},1,{"$nulls":3},{"$f":"I36-J36","v":0},{"$f":"J36-K36","v":0}]
[{"$nulls":7},2,{"$nulls":3},{"$f":"I37-J37","v":0},{"$f":"J37-K37","v":0}]
[{"$nulls":7},3,{"$nulls":3},{"$f":"I38-J38","v":0},0]
[{"$nulls":7},"Ø",{"$f":"AVERAGE(I36:I38)","v":{"$error":"#DIV/0!"}},{"$f":"AVERAGE(J36:J38)","v":{"$error":"#DIV/0!"}},{"$error":"#DIV/0!"},{"$f":"AVERAGE(L36:L38)","v":0},0,{"$error":"#DIV/0!"},{"$error":"#DIV/0!"},{"$error":"#DIV/0!"},{"$error":"#DIV/0!"},null,null,{"$error":"#DIV/0!"}]
[{"$nulls":7},1,{"$nulls":3},{"$f":"I40-J40","v":0},{"$f":"J40-K40","v":0}]
[{"$nulls":7},2,{"$nulls":3},{"$f":"I41-J41","v":0},0]
[{"$nulls":7},3,{"$nulls":3},{"$f":"I42-J42","v":0},0]
[{"$nulls":7},"Ø",{"$f":"AVERAGE(I40:I42)","v":{"$error":"#DIV/0!"}},{"$f":"AVERAGE(J40:J42)","v":{"$error":"#DIV/0!"}},{"$error":"#DIV/0!"},{"$f":"AVERAGE(L40:L42)","v":0},{"$f":"AVERAGE(M40:M42)","v":0},{"$error":"#DIV/0!"},{"$error":"#DIV/0!"},{"$error":"#DIV/0!"},{"$error":"#DIV/0!"},{"$error":"#DIV/0!"},null,{"$error":"#DIV/0!"}]
[{"$nulls":7},1,{"$nulls":3},{"$f":"I44-J44","v":0},{"$f":"J44-K44","v":0}]
[{"$nulls":7},2,{"$nulls":3},{"$f":"I45-J45","v":0},{"$f":"J45-K45","v":0}]
[{"$nulls":7},3,{"$nulls":3},{"$f":"I46-J46","v":0},0]
[{"$nulls":7},"Ø",{"$f":"AVERAGE(I44:I46)","v":{"$error":"#DIV/0!"}},{"$f":"AVERAGE(J44:J46)","v":{"$error":"#DIV/0!"}},{"$error":"#DIV/0!"},0,0,{"$error":"#DIV/0!"},{"$error":"#DIV/0!"},{"$error":"#DIV/0!"},{"$error":"#DIV/0!"},{"$error":"#DIV/0!"},null,{"$error":"#DIV/0!"}]
[{"$nulls":7},1,{"$nulls":3},{"$f":"I48-J48","v":0},{"$f":"J48-K48","v":0}]
[{"$nulls":7},2,{"$nulls":3},{"$f":"I49-J49","v":0},{"$f":"J49-K49","v":0}]
[{"$nulls":7},3,{"$nulls":3},{"$f":"I50-J50","v":0},0]
[{"$nulls":7},"Ø",{"$f":"AVERAGE(I48:I50)","v":{"$error":"#DIV/0!"}},{"$f":"AVERAGE(J48:J50)","v":{"$error":"#DIV/0!"}},{"$f":"AVERAGE(K48:K50)","v":{"$error":"#DIV/0!"}},{"$f":"AVERAGE(L48:L50)","v":0},0,{"$error":"#DIV/0!"},{"$error":"#DIV/0!"},{"$error":"#DIV/0!"},{"$error":"#DIV/0!"},{"$error":"#DIV/0!"},null,{"$error":"#DIV/0!"}]
[{"$nulls":7},1,{"$nulls":3},{"$f":"I52-J52","v":0},{"$f":"J52-K52","v":0}]
[{"$nulls":7},2,{"$nulls":3},{"$f":"I53-J53","v":0},{"$f":"J53-K53","v":0}]
[{"$nulls":7},3,{"$nulls":3},{"$f":"I54-J54","v":0},0]
[{"$nulls":7},"Ø",{"$f":"AVERAGE(I52:I54)","v":{"$error":"#DIV/0!"}},{"$f":"AVERAGE(J52:J54)","v":{"$error":"#DIV/0!"}},{"$error":"#DIV/0!"},{"$f":"AVERAGE(L52:L54)","v":0},0,{"$error":"#DIV/0!"},{"$error":"#DIV/0!"},{"$error":"#DIV/0!"},{"$error":"#DIV/0!"},{"$error":"#DIV/0!"},null,{"$error":"#DIV/0!"}]
[{"$nulls":7},1,{"$nulls":3},{"$f":"I56-J56","v":0},{"$f":"J56-K56","v":0}]
[{"$nulls":7},2,{"$nulls":3},{"$f":"I57-J57","v":0},{"$f":"J57-K57","v":0}]
[{"$nulls":7},3,{"$nulls":3},{"$f":"I58-J58","v":0},0]
[{"$nulls":7},"Ø",{"$f":"AVERAGE(I56:I58)","v":{"$error":"#DIV/0!"}},{"$f":"AVERAGE(J56:J58)","v":{"$error":"#DIV/0!"}},{"$f":"AVERAGE(K56:K58)","v":{"$error":"#DIV/0!"}},{"$f":"AVERAGE(L56:L58)","v":0},{"$f":"AVERAGE(M56:M58)","v":0},{"$error":"#DIV/0!"},{"$error":"#DIV/0!"},{"$error":"#DIV/0!"},{"$error":"#DIV/0!"},null,null,{"$error":"#DIV/0!"}]
[{"$nulls":7},1,{"$nulls":3},{"$f":"I60-J60","v":0},{"$f":"J60-K60","v":0}]
[{"$nulls":7},2,{"$nulls":3},{"$f":"I61-J61","v":0},{"$f":"J61-K61","v":0}]
[{"$nulls":7},3,{"$nulls":3},{"$f":"I62-J62","v":0},0]
[{"$nulls":7},"Ø",{"$f":"AVERAGE(I60:I62)","v":{"$error":"#DIV/0!"}},{"$f":"AVERAGE(J60:J62)","v":{"$error":"#DIV/0!"}},{"$f":"AVERAGE(K60:K62)","v":{"$error":"#DIV/0!"}},{"$f":"AVERAGE(L60:L62)","v":0},{"$f":"AVERAGE(M60:M62)","v":0},{"$error":"#DIV/0!"},{"$error":"#DIV/0!"},{"$error":"#DIV/0!"},{"$error":"#DIV/0!"},null,null,{"$error":"#DIV/0!"}]
[{"$nulls":7},1,{"$nulls":3},{"$f":"I64-J64","v":0},{"$f":"J64-K64","v":0}]
[{"$nulls":7},2,{"$nulls":3},{"$f":"I65-J65","v":0},{"$f":"J65-K65","v":0}]
[{"$nulls":7},3,{"$nulls":3},{"$f":"I66-J66","v":0},0]
[{"$nulls":7},"Ø",{"$f":"AVERAGE(I64:I66)","v":{"$error":"#DIV/0!"}},{"$f":"AVERAGE(J64:J66)","v":{"$error":"#DIV/0!"}},{"$f":"AVERAGE(K64:K66)","v":{"$error":"#DIV/0!"}},{"$f":"AVERAGE(L64:L66)","v":0},{"$f":"AVERAGE(M64:M66)","v":0},{"$error":"#DIV/0!"},{"$error":"#DIV/0!"},{"$error":"#DIV/0!"},{"$error":"#DIV/0!"},null,null,{"$error":"#DIV/0!"}]
[{"$nulls":7},1,{"$nulls":3},{"$f":"I68-J68","v":0},{"$f":"J68-K68","v":0}]
[{"$nulls":7},2,{"$nulls":3},{"$f":"I69-J69","v":0},{"$f":"J69-K69","v":0}]
[{"$nulls":7},3,{"$nulls":3},{"$f":"I70-J70","v":0},0]
[{"$nulls":7},"Ø",{"$f":"AVERAGE(I68:I70)","v":{"$error":"#DIV/0!"}},{"$f":"AVERAGE(J68:J70)","v":{"$error":"#DIV/0!"}},{"$f":"AVERAGE(K68:K70)","v":{"$error":"#DIV/0!"}},{"$f":"AVERAGE(L68:L70)","v":0},{"$f":"AVERAGE(M68:M70)","v":0},{"$error":"#DIV/0!"},{"$error":"#DIV/0!"},{"$error":"#DIV/0!"},{"$error":"#DIV/0!"},null,null,{"$error":"#DIV/0!"}]
[{"$nulls":7},1,{"$nulls":3},{"$f":"I72-J72","v":0},{"$f":"J72-K72","v":0}]
[{"$nulls":7},2,{"$nulls":3},{"$f":"I73-J73","v":0},{"$f":"J73-K73","v":0}]
[{"$nulls":7},3,{"$nulls":3},{"$f":"I74-J74","v":0},0]
[{"$nulls":7},"Ø",{"$f":"AVERAGE(I72:I74)","v":{"$error":"#DIV/0!"}},{"$f":"AVERAGE(J72:J74)","v":{"$error":"#DIV/0!"}},{"$f":"AVERAGE(K72:K74)","v":{"$error":"#DIV/0!"}},{"$f":"AVERAGE(L72:L74)","v":0},{"$f":"AVERAGE(M72:M74)","v":0},{"$error":"#DIV/0!"},{"$error":"#DIV/0!"},{"$error":"#DIV/0!"},{"$error":"#DIV/0!"},null,null,{"$error":"#DIV/0!"}]
[{"$nulls":7},1,{"$nulls":3},{"$f":"I76-J76","v":0},{"$f":"J76-K76","v":0}]
[{"$nulls":7},2,{"$nulls":3},{"$f":"I77-J77","v":0},{"$f":"J77-K77","v":0}]
[{"$nulls":7},3,{"$nulls":3},{"$f":"I78-J78","v":0},0]
[{"$nulls":7},"Ø",{"$f":"AVERAGE(I76:I78)","v":{"$error":"#DIV/0!"}},{"$f":"AVERAGE(J76:J78)","v":{"$error":"#DIV/0!"}},{"$f":"AVERAGE(K76:K78)","v":{"$error":"#DIV/0!"}},{"$f":"AVERAGE(L76:L78)","v":0},{"$f":"AVERAGE(M76:M78)","v":0},{"$error":"#DIV/0!"},{"$error":"#DIV/0!"},{"$error":"#DIV/0!"},{"$error":"#DIV/0!"},null,null,{"$error":"#DIV/0!"}]
[{"$nulls":7},1,{"$nulls":3},{"$f":"I80-J80","v":0},{"$f":"J80-K80","v":0}]
[{"$nulls":7},2,{"$nulls":3},{"$f":"I81-J81","v":0},{"$f":"J81-K81","v":0}]
[{"$nulls":7},3,{"$nulls":3},{"$f":"I82-J82","v":0},0]
[{"$nulls":7},"Ø",{"$f":"AVERAGE(I80:I82)","v":{"$error":"#DIV/0!"}},{"$f":"AVERAGE(J80:J82)","v":{"$error":"#DIV/0!"}},{"$f":"AVERAGE(K80:K82)","v":{"$error":"#DIV/0!"}},{"$f":"AVERAGE(L80:L82)","v":0},{"$f":"AVERAGE(M80:M82)","v":0},{"$error":"#DIV/0!"},{"$error":"#DIV/0!"},{"$error":"#DIV/0!"},{"$error":"#DIV/0!"},null,null,{"$error":"#DIV/0!"}]

{"sheet":"Fällmittel","index":1,"n_rows":0,"n_cols":0,"rows_kept":0}

{"sheet":"ÜbersichtMessSteuerRegeltechnik","index":2,"n_rows":16,"n_cols":6,"rows_kept":16,"merged":[[1,1,1,5],[9,1,9,5]]}
[null,"Bestand"]
[null,"Übersicht Mess-, Steuer- und Regeltechnik P-Fällung"]
[null,"Dosierstrategie","Messstelle","Messstellenort","Dosierstelle","Dosierstellenort"]
[null,"Fest eingestellte, manuelle Dosierung",1,"Ablauf Biologie",1,"Biologie"]
[null,null,2,null,2]
[null,null,3,null,3]
[]
[]
[null,"Geplant bis:"]
[null,"Übersicht Mess-, Steuer- und Regeltechnik P-Fällung"]
[null,"Dosierstrategie","Messstelle","Messstellenort","Dosierstelle","Dosierstellenort"]
[null,"Steuerung (frachtabhängig) nach ortho-P-Onlinemessung",1,"Ablauf Biologie",1,"Biologie"]
[null,null,2,null,2]
[null,null,3,null,3]
[]
[null,"Weiße Felder = Dropdown - Auswahllisten"]

{"sheet":"MST Listen","index":3,"n_rows":11,"n_cols":4,"rows_kept":11,"hidden":true}
[]
[null,"Dosierstrategie","Messstellen","Dosierstellen"]
[null,"Fest eingestellte, manuelle Dosierung","Zulauf Vorklärung","Zulauf Vorklärung"]
[null,"Durchflussproportionale Fällmitteldosierung","Zulauf Biologie","Zulauf Biologie"]
[null,"Automatisch nach Dosierungsprofil (Tagesganglinie)","Ablauf Biologie (Belebungsbecken)","Biologie"]
[null,"Steuerung (frachtabhängig) nach ortho-P-Onlinemessung","Ablauf Nachklärung","Ablauf Biologie (Belebungsbecken)"]
[null,"Regelung (frachtabhängig) nach ortho-P-Onlinemessung","Zulaufmengenmessung","Rücklaufschlamm"]
[null,"Steuerung (frachtabhängig) nach ortho-P- und Pges-Onlinemessung","Ablaufmengenmessung","Verteilerbauwerk Nachklärung"]
[null,"Regelung (frachtabhängig) nach ortho-P- und Pges-Onlinemessung"]
[null,"Kombinierte Regelung und Steuerung nach ortho-P-Onlinemessung"]
[null,"Kombinierte Regelung und Steuerung nach ortho-P , Pges-Onlinemessung"]

{"sheet":"Pges_Betriebsmittelwert","index":4,"n_rows":37,"n_cols":10,"rows_kept":37,"merged":[[3,5,3,9],[8,1,10,1],[8,2,10,2],[8,3,8,8],[8,9,9,9],[9,3,9,4],[9,5,9,6],[9,7,9,8],[37,0,42,9]]}
["Ergebnisse der Selbstüberwachung",{"$nulls":5},"Berichtsjahr:"]
["Pges-Messereignisse im Ablauf"]
[]
["Kläranlage :"]
[]
["WS = Wetterschlüssel : trocken = 1; Frost = 2; Regen = 3; Gewitter = 4; Schneeschmelze = 5; "]
["Schneefall = 6; Regennachlauf = 7; Hochwassereinfluss = 8"]
[]
[null,"Wetterschlüssel","Eingeschänke P-Fällung                              ( Ja / Nein )","Messereignis",{"$nulls":5},"Pges - Tagesfracht (gemessen bzw. hochgerechnet)"]
[{"$nulls":3},"Abwassermenge",null,"Pges-Ablaufkonzentration",null,"AFS"]
["Datum",null,null,"Wert","Einheit (l/s,  m³/h, m³/2h, m³/d)","Wert in mg/l","Probenahmeart (Stp, qStP, 2h-MP, 24h-MP, k24h-MP; dMWonline)","Wert in mg/l","Probenahmeart (StP, qStp, 2h-MP, 24h-MP, k24h-MP)","kg/d"]
{"$rows_empty":20}
["Mittelwert Tagesfrachten in kg/d",{"$nulls":4},{"$f":"IFERROR(ROUND(AVERAGE(F12:F31),2),\"\")","v":""},{"$nulls":3},{"$f":"IFERROR(ROUND(AVERAGE(J12:J31),2),\"\")","v":""}]
["Jahresfracht in kg/a",{"$nulls":8},{"$f":"IFERROR(ROUND(J32*365,0),\"\")","v":""}]
["Gesamtabwassermenge in m3/a"]
["Pges-Betriebsmittelwert Ablauf in mg/l",{"$nulls":8},{"$f":"IFERROR(ROUND((J33/J34)*1000,2),\"\")","v":""}]
[]
["Bemerkungen:"]

{"sheet":"Vorlage 2h Fracht","index":5,"n_rows":56,"n_cols":14,"rows_kept":56}
["Ergebnisse der Selbstüberwachung",{"$nulls":9},"Berichtsjahr:"]
["zusätzliche Anforderungen (§ 2 Nr. 5 EÜVOA)"]
[]
["Kläranlage :"]
[]
["Parameter:",null,"NH4-N",{"$nulls":4},"BSB5",{"$nulls":3},"CSB / TOC"]
[null,null,"Ablauf: 2h- Frachtwerte",{"$nulls":4},"Ablauf: 2h- Frachtwerte",{"$nulls":3},"Ablauf: 2h- Frachtwerte"]
[{"$nulls":5},"bei Trockenwetter",{"$nulls":3},"bei Trockenwetter",{"$nulls":3},"bei Trockenwetter"]
[null,null,"Probenahmeart:",{"$nulls":4},"Probenahmeart:",{"$nulls":3},"Probenahmeart:"]
[]
[null,null,"Überwachungswert",{"$nulls":4},"Überwachungswert",{"$nulls":3},"Überwachungswert"]
[{"$nulls":5},"kg/2h",{"$nulls":3},"kg/2h",{"$nulls":3},"kg/2h"]
[]
["Monat",null,"Meßwerte",null,"Mittel-","Maximal-",null,"Meß-","Mittel-","Maximal-",null,"Meß-","Mittel-","Maximal-"]
[null,null,"Gesamt","> 12°C","wert","wert",null,"werte","wert","wert",null,"werte","wert","wert"]
["-",null,"Anzahl","Anzahl","kg/2h","kg/2h",null,"Anzahl","kg/2h","kg/2h",null,"Anzahl","kg/2h","kg/2h"]
["Januar"]
["Februar"]
["März"]
["April"]
["Mai"]
["Juni"]
["Juli"]
["August"]
["September"]
["Oktober"]
["November"]
["Dezember"]
["Summe /",null,{"$f":"SUM(C17:C28)","v":0},{"$f":"SUM(D17:D28)","v":0},{"$f":"IF(C29=0,0,AVERAGE(E17:E28))","v":{"v":0,"d":"0.0"}},null,null,{"$f":"SUM(H17:H28)","v":0},{"$f":"IF(H29=0,0,AVERAGE(I17:I28))","v":{"v":0,"d":"0.0"}},null,null,{"$f":"SUM(L17:L28)","v":0},{"$f":"IF(L29=0,0,AVERAGE(M17:M28))","v":{"v":0,"d":"0.0"}}]
["Jahresmittel"]
[]
["Parameter :",null,"Nges, anorg.",{"$nulls":4},"Pges"]
[null,null,"Ablauf: 2h- Frachtwerte",{"$nulls":4},"Ablauf: 2h- Frachtwerte"]
[{"$nulls":5},"bei Trockenwetter",{"$nulls":3},"bei Trockenwetter",{"$nulls":3},"bei Trockenwetter"]
[null,null,"Probenahmeart:",{"$nulls":4},"Probenahmeart:",{"$nulls":3},"Probenahmeart:"]
[]
[null,null,"Überwachungswert",{"$nulls":4},"Überwachungswert",{"$nulls":3},"Überwachungswert"]
[{"$nulls":5},"kg/2h",{"$nulls":3},"kg/2h"]
[]
["Monat",null,"Meßwerte",null,"Mittel-","Maximal-",null,"Meß-","Mittel-","Maximal-",null,"Meß-","Mittel-","Maximal-"]
[null,null,"Gesamt","> 12°C","wert","wert",null,"werte","wert","wert",null,"werte","wert","wert"]
["-",null,"Anzahl","Anzahl","kg/2h","kg/2h",null,"Anzahl","kg/2h","kg/2h",null,"Anzahl"]
["Januar"]
["Februar"]
["März"]
["April"]
["Mai"]
["Juni"]
["Juli"]
["August"]
["September"]
["Oktober"]
["November"]
["Dezember"]
["Summe /",null,{"$f":"SUM(C43:C54)","v":0},{"$f":"SUM(D43:D54)","v":0},{"$f":"IF(C55=0,0,AVERAGE(E43:E54))","v":{"v":0,"d":"0.0"}},null,null,{"$f":"SUM(H43:H54)","v":0},{"$f":"IF(H55=0,0,AVERAGE(I43:I54))","v":{"v":0,"d":"0.0"}},null,null,{"$f":"SUM(L43:L54)","v":0},{"$f":"IF(L55=0,0,AVERAGE(M43:M54))","v":{"v":0,"d":"0.0"}}]
["Jahresmittel"]

{"sheet":"Vorlage k24h Fracht","index":6,"n_rows":50,"n_cols":12,"rows_kept":50,"merged":[[10,3,10,5],[10,9,10,11],[33,3,33,5],[33,9,33,11]]}
["Ergebnisse der Selbstüberwachung",{"$nulls":8},"Berichtsjahr:"]
[]
[]
["Kläranlage :"]
[]
["Parameter:",null,"CSB",{"$nulls":5},"TOC"]
[null,null,"Reinigungsleistungen",{"$nulls":5},"Reinigungsleistungen"]
[null,null,"ermittelt aus korrespondierenden ",{"$nulls":5},"ermittelt aus korrespondierenden "]
[null,null,"24-h-Mischproben",{"$nulls":5},"24-h-Mischproben"]
[null,null,"bei Trocken- und Regenwetter",{"$nulls":5},"bei Trocken- und Regenwetter"]
["Monat",null,"Mess-","Mittelwert",{"$nulls":4},"Mess-","Mittelwert"]
[null,null,"werte","Zulauf","Ablauf","Reinigung",null,null,"werte","Zulauf","Ablauf","Reinigung"]
["-",null,"Anzahl","kg/d","kg/d","%",null,null,"Anzahl","kg/d","kg/d","%"]
["Januar"]
["Februar"]
["März"]
["April"]
["Mai"]
["Juni"]
["Juli"]
["August"]
["September"]
["Oktober"]
["November"]
["Dezember"]
["Summe /",null,null,{"$f":"IF(C26=0,0,AVERAGE(D14:D25))","v":{"v":0,"d":"0.0"}},{"$f":"IF(C26=0,0,AVERAGE(E14:E25))","v":{"v":0,"d":"0.0"}},{"$nulls":3},{"$f":"SUM(I14:I25)","v":0},{"$f":"IF(I26=0,0,AVERAGE(J14:J25))","v":{"v":0,"d":"0.0"}},{"$f":"IF(I26=0,0,AVERAGE(K14:K25))","v":{"v":0,"d":"0.0"}}]
["Jahresmittel"]
[]
["Parameter:",null,"TNb",{"$nulls":5},"Pges"]
[null,null,"Reinigungsleistungen",{"$nulls":5},"Reinigungsleistungen"]
[null,null,"ermittelt aus korrespondierenden ",{"$nulls":5},"ermittelt aus korrespondierenden "]
[null,null,"24-h-Mischproben",{"$nulls":5},"24-h-Mischproben"]
[null,null,"bei Trocken- und Regenwetter",{"$nulls":5},"bei Trocken- und Regenwetter"]
["Monat",null,"Mess-","Mittelwert",{"$nulls":4},"Mess-","Mittelwert"]
[null,null,"werte","Zulauf","Ablauf","Reinigung",null,null,"werte","Zulauf","Ablauf","Reinigung"]
["-",null,"Anzahl","kg/d","kg/d","%",null,null,"Anzahl","kg/d","kg/d","%"]
["Januar"]
["Februar"]
["März"]
["April"]
["Mai"]
["Juni"]
["Juli"]
["August"]
["September"]
["Oktober"]
["November"]
["Dezember"]
["Summe /",null,{"$f":"SUM(C37:C48)","v":0},{"$f":"IF(C49=0,0,AVERAGE(D37:D48))","v":{"v":0,"d":"0.0"}},{"$f":"IF(C49=0,0,AVERAGE(E37:E48))","v":{"v":0,"d":"0.0"}},{"$nulls":3},{"$f":"SUM(I37:I48)","v":0},{"$f":"IF(I49=0,0,AVERAGE(J37:J48))","v":{"v":0,"d":"0.0"}},{"$f":"IF(I49=0,0,AVERAGE(K37:K48))","v":{"v":0,"d":"0.0"}}]
["Jahresmittel"]

{"sheet":"Vorlage Überschreitg","index":7,"n_rows":10,"n_cols":6,"rows_kept":10}
["Ergebnisse der Selbstüberwachung",{"$nulls":3},"Berichtsjahr"]
["zusätzliche Anforderungen (§ 2 Nr. 5 EÜVOA)"]
[]
["Kläranlage :"]
[]
["Probenahmestelle: ","Ablauf der Kläranlage"]
[]
["Überschreitungen der Überwachungsparameter"]
[]
["Parameter","Einheit","Datum","Messwert","Temp. Ablauf Biologie bei Stickstoff-parametern","Über-wachungs / Höchstwert"]

{"sheet":"Vorlage Fremdwasser","index":8,"n_rows":36,"n_cols":17,"rows_kept":36,"merged":[[33,12,33,15],[34,12,34,15],[35,12,35,15]]}
["Ergebnisse der Selbstüberwachung",{"$nulls":13},"Berichtsjahr :"]
[]
[]
["Kläranlage :"]
[]
["Meßprotokoll - Fremdwasserermittlung"]
[]
[]
["Die Ermittlung erfolgt bei Trockenwetter anhand des geringsten Durchflusses (z.B. Nachtmessungen gegen 3 Uhr)"]
[" und Messungen des Tagesabwasserzuflusses über 24 Stunden (Zählwerksablesung). "]
[]
["Spitzenzufluß bei Trockenwetter nach Planung: ",{"$nulls":3},"l/s"]
["Derzeit angeschlossene (echte) Einwohner etwa: ",{"$nulls":3},"EZ"]
["Durchflußmeßeinrichtung (Meßverfahren): "]
["Oberer Meßbereich des Gerätes bis:"]
["Meßanlage überprüft am: "]
["Kanal Einzugsgebiet: ",{"$nulls":3},"ha"]
["geschätzte längste Fließzeit"]
[]
[{"$nulls":3},"Einheit","Datum der Fremdwasserbestimmung"]
[{"$nulls":3},"Nr.",1,2,3,4,5,6,7,8,9,10,11,12]
[{"$nulls":3},"Datum"]
["A","gemessener geringster Nachtzufluß",null,"l/s"]
["B","Abzug für geschätzten Nachtzufluss der angeschlossenen Einwohner (q*EZ / 1000)",null,"l/s"]
["C","abzüglich geschätzter Nachtzufluß aus Industrie                      ",null,"l/s"]
["D","Fremdwasserzufluß = (a - b - c)                                             ",null,"l/s",{"$f":"E23-E24-E25","v":0},0,0,0,0,0,0,0,0,0,0,0]
["E","Tagesfremdwasserzufluß (d x 86,4)                                  ",null,"m3/d",{"$f":"E26*86.4","v":0},0,0,0,0,0,0,0,0,0,0,0,{"$f":"SUM(E27:P27)","v":0}]
["F","gemessener Tagesabwasserzufluß (24 Std. bei TW)",null," "]
[null,"  einschl. Fremdwasser                                                     ",null,"m3/d",{"$nulls":12},{"$f":"SUM(E29:P29)","v":0}]
["G","Tagesschmutzwasserzufluß (f - e)                                    ",null,"m3/d",{"$f":"E29-E27","v":0},0,0,0,0,0,0,0,0,0,0,0]
["H","Fremdwasseranteil im Jahresmittel (e/f * 100)",null,"%",{"$f":"IF(E29=0,0,E27/E29)","v":{"v":0,"d":"0%"}},{"v":0,"d":"0%"},{"v":0,"d":"0%"},{"v":0,"d":"0%"},{"v":0,"d":"0%"},{"v":0,"d":"0%"},{"v":0,"d":"0%"},{"v":0,"d":"0%"},{"v":0,"d":"0%"},{"v":0,"d":"0%"},{"v":0,"d":"0%"},{"v":0,"d":"0%"},{"v":0,"d":"0%"}]
[]
[{"$nulls":9},"Einwohnerzahl (EZ)",null,"Faktor q"]
[{"$nulls":9},"< 5000",null,0.3,"gleichförmiges Kanalnetz ohne Einrichtungen, die zu einer deutlischen Verlängerung der tatsächlichen Flieszeiten bei Trcokenwetter führen."]
["Fremdwasser-Anteil        (e/f x 100)",{"$nulls":5},{"$f":"Q31*100","v":{"v":0,"d":"0.0"}},"%",null,"5.000 - 100.000",null,0.5]
[{"$nulls":9},"> 100.000",null,{"v":1,"d":"1.0"},"große Kanalnetze oder Flieszeiten  bei Trockenwetter von mehr als 10 Stunden."]

{"sheet":"Prüfergebnis Durchflussmessung","index":9,"n_rows":36,"n_cols":1,"rows_kept":36,"merged":[[6,0,6,2],[9,1,9,2],[10,1,10,2],[11,1,11,2],[12,1,12,2],[13,1,13,2],[14,1,14,2],[15,1,15,2],[16,1,16,2],[17,1,17,2],[18,1,18,2],[19,1,19,2],[20,1,20,2],[21,0,21,1],[22,1,22,2],[23,1,23,2],[24,1,24,2],[25,1,25,2],[26,0,34,0],[26,1,34,2],[35,0,42,0],[35,1,42,2]]}
["Prüfergebnis der Durchflussmesseinrichtung"]
[]
["Unternehmer der Abwasserbeseitigung:"]
["Kläranlage:"]
["Ausbaugröße:"]
[]
["Prüfergebnis der Durchflussmesseinrichtung"]
[]
[]
["Ort der Messstelle"]
[]
["Messverfahren/Messprinzip"]
["Hersteller"]
["Gerätetyp"]
["Messwertaufnehmer"]
["Messwertumformer"]
["Messwertregistrierung"]
["Messbereich (l/s)         von bis"]
["Qm l/s"]
["Prüfverfahren (gleichwertiges oder besseres Messverfahren als die vorhandenen Durchflussmesseinrichtung, ggf. Erläuterung)"]
["Datum der Prüfung"]
["Festgestellte Abweichungen in % bei"]
[]
[]
[]
[]
["Beurteilung"]
{"$rows_empty":8}
["Erforderliche Maßnahmen"]

{"sheet":"JSM Eingabe+TW","index":10,"n_rows":118,"n_cols":166,"rows_kept":118,"merged":[[6,3,6,8],[6,12,6,17],[11,1,14,1],[11,3,14,4],[17,1,17,4],[63,1,63,3],[64,1,64,3],[65,1,65,3],[66,1,66,3],[67,1,67,3],[68,1,68,3],[73,3,73,27]]}
["JSM"]
[null,"Ergebnisse der Selbstüberwachung",{"$nulls":25},"Programmversion 7.3.9"]
[]
[]
[null,"Ermittlung der Jahresschmutzwassermenge (JSM) und des Fremdwassers (QF)",{"$nulls":25},"Blatt 1"]
[]
[null,"Kläranlage :",{"$nulls":9},"VG / Stadt:  ",{"$nulls":14},"Berichtsjahr :"]
[]
[null,"Eingabedaten"]
[]
[]
[null,"INFO",null,"INFO- Feld mit dem Mauszeiger anfahren",{"$nulls":5},"angeschlossene EZ:",null,"E",{"$nulls":5},"Trinkwasserverbrauch kommunales Netz:",null,"m³/a",{"$nulls":5},"Durchflußmeßeinrichtung (Meßverfahren):"]
[{"$nulls":17},"Abzug für Verluste ( i.d.R. 5 - 10 %):",null,"%",{"$nulls":5},"Oberer Meßbereich des Gerätes bis:"]
[{"$nulls":17},"ODER alternativ Verlustabzug in cbm:",null,"m³/a",{"$nulls":5},"Unterer Meßbereich des Gerätes bis:"]
[{"$nulls":17},"Trinkwasserverbrauch Eigenwasserversorgungsanlagen:",null,"m³/a",{"$nulls":5},"Meßanlage letztmalig überprüft am:"]
[{"$nulls":9},"Rechnerischer Mindestabfluss der KA Q t min, d:",{"$f":"IF($K$12<>\"\",ROUND((($K$12/2)*80)/1000,0),\"\")","v":""},"m³/d",{"$nulls":5},"Abzug für Verluste aus Eigenversorgungen:",null,"%",{"$nulls":5},"Spitzenzufluß bei Trockenwetter nach Wasserrecht Q t, h:",null,"m³/h"]
[{"$nulls":9},"Spitzenzufluß bei Trockenwetter nach Wasserrecht Q t, d:",null,"m³/d",{"$nulls":5},"Trinkwasserverbrauch gesamt:",{"$f":"SUM(S12+S15)","v":0},"m³/a",{"$nulls":5},"Kanal- Einzugsgebiet AE:",null,"ha"]
[null,"nur reines Trennsystem: x",{"$nulls":7},"zugelassener Abfluss der KA Q m:",null,"l/s",{"$nulls":5},"Reduzierter Trinkwasserverbrauch:",{"$f":"IF(S13=0,S12-S14+S15*(100-S16)/100,S12*(100-S13)/100+S15*(100-S16)/100)","v":0},"m³/a",{"$nulls":5},"geschätzte längste Fließzeit:",null,"h",{"$nulls":99},{"$f":"SUMIF(DX32:EI62,8,DX32:EI62)/8","v":365},"mal Erstatzwert eingefügt"]
[]
[]
[]
[]
[{"$nulls":3},"gemessen wurde ","automatisch",{"$nulls":5},"Rot = auffälliger Wert",{"$nulls":15},"W = Wetterschlüssel : trocken = 1; Frost = 2; Regen = 3; Gewitter = 4; Schneeschmelze = 5; Schneefall = 6; Regennachlauf = 7; Hochwassereinfluss = 8",{"$nulls":113},"d","e","f","g",{"$nulls":5},"Gesamtmittelwert",null,{"$f":"AVERAGE(EL32:EL62,EN32:EN62,EP32:EP62,ER32:ER62,ET32:ET62,EV32:EV62,EX32:EX62,EZ32:EZ62,FB32:FB62,FD32:FD62,FF32:FF62,FH32:FH62,0.000001)","v":{"v":1e-06,"d":"0.00"}}]
[{"$nulls":4},"im Zulauf "," ",{"$nulls":20},"Trockenwetter ist bei einer Niederschlagshöhe von weniger oder gleich 1,0 mm/d und weniger oder gleich 1,0 mm/d am Vortag"]
[{"$nulls":4},"oder im Ablauf",{"$nulls":21},"  Bei fehlenden oder fehlerhaften Tagesmessungen leeres Feld oder begründeten Schätzwert, aber bitte  nicht  0  oder andere Informationen eintragen.",{"$nulls":113},"Trockenwetter"]
[{"$nulls":31},"Für Dichtemittel. Nicht gemessene Tage bleiben unberücksichtigt. Messungen bei HW werden berücksichtigt.",{"$nulls":14},"Tagesmengen ohne Hochwasser und Ersatzwerte",{"$nulls":26},"In dieser Tabelle wird bei HW und fehlenden Messungen ein plausibler Ersatzwert eingefügt",{"$nulls":12},"Hierbei werden Fehltage mit W = 8 (=Hochwassser) geführt",{"$nulls":13},"für gleitendes Minimum",null,null,"Tagesmessungen bei Hochwasser und fehlende Messungen werden durch Erstatzwert ersetzt.",{"$nulls":9},"für Jahresdauerlinie",null,null,"Tagesmessungen bei Hochwasser und fehlende Messungen werden durch Erstatzwert ersetzt.",{"$nulls":10},"Wetterschlüssel"]
[{"$nulls":84}," "]
[null,"Wetterschlüssel (W) und Mischwasser-Tagesabfluss (Q) in m³/d:"]
[{"$nulls":4},"Januar",null,"Februar",null,"März",null,"April",null,"Mai",null,"Juni",null,"Juli",null,"August",null,"September",null,"Oktober",null,"November",null,"Dezember",{"$nulls":4},"Jan ","Feb","Mrz","Apr","Mai","Jun","Jul","Aug","Sep","Okt","Nov","Dez",{"$nulls":4},"Januar",null,"Februar",null,"März",null,"April",null,"Mai",null,"Juni",null,"Juli",null,"August",null,"September",null,"Oktober",null,"November",null,"Dezember",{"$nulls":4},"Januar",null,"Februar",null,"März",null,"April",null,"Mai",null,"Juni",null,"Juli",null,"August",null,"September",null,"Oktober",null,"November",null,"Dezember",{"$nulls":3},"Jan ","Feb","Mrz","Apr","Mai","Jun","Jul","Aug","Sep","Okt","Nov","Dez",null,"Jan ","Feb","Mrz","Apr","Mai","Jun","Jul","Aug","Sep","Okt","Nov","Dez",{"$nulls":16},"Januar",null,"Februar",null,"März",null,"April",null,"Mai",null,"Juni",null,"Juli",null,"August",null,"September",null,"Oktober",null,"November",null,"Dezember"]
[null,"Tag",null,"W ","Q","W ","Q","W ","Q","W ","Q","W ","Q","W ","Q","W ","Q","W ","Q","W ","Q","W ","Q","W ","Q","W ","Q",{"$nulls":19},"W ",null,"W ",null,"W ",null,"W ",null,"W ",null,"W ",null,"W ",null,"W ",null,"W ",null,"W ",null,"W ",null,"W ",{"$nulls":4},"W ",null,"W ",null,"W ",null,"W ",null,"W ",null,"W ",null,"W ",null,"W ",null,"W ",null,"W ",null,"W ",null,"W ",{"$nulls":44},"W ",null,"W ",null,"W ",null,"W ",null,"W ",null,"W ",null,"W ",null,"W ",null,"W ",null,"W ",null,"W ",null,"W "]
[{"$nulls":48},"Tagesabflußmengen in cbm/d",{"$nulls":25},"Tagesabflußmengen in cbm/d"]
[null,1,{"$nulls":29},{"$f":"IF(E32=0,\" \",IF(E32>0,E32,\" \"))","v":" "},{"$f":"IF(G32=0,\" \",IF(G32>0,G32,\" \"))","v":" "},{"$f":"IF(I32=0,\" \",IF(I32>0,I32,\" \"))","v":" "},{"$f":"IF(K32=0,\" \",IF(K32>0,K32,\" \"))","v":" "},{"$f":"IF(M32=0,\" \",IF(M32>0,M32,\" \"))","v":" "},{"$f":"IF(O32=0,\" \",IF(O32>0,O32,\" \"))","v":" "},{"$f":"IF(Q32=0,\" \",IF(Q32>0,Q32,\" \"))","v":" "},{"$f":"IF(S32=0,\" \",IF(S32>0,S32,\" \"))","v":" "},{"$f":"IF(U32=0,\" \",IF(U32>0,U32,\" \"))","v":" "},{"$f":"IF(W32=0,\" \",IF(W32>0,W32,\" \"))","v":" "},{"$f":"IF(Y32=0,\" \",IF(Y32>0,Y32,\" \"))","v":" "},{"$f":"IF(AA32=0,\" \",IF(AA32>0,AA32,\" \"))","v":" "},{"$nulls":3},{"$f":"D32","v":0},{"$f":"IF(AU32=8,\"\",IF(E32=\"\",\"\",E32))","v":""},{"$f":"F32","v":0},{"$f":"IF(AW32=8,\"\",IF(G32=\"\",\"\",G32))","v":""},{"$f":"H32","v":0},{"$f":"IF(AY32=8,\"\",IF(I32=\"\",\"\",I32))","v":""},{"$f":"J32","v":0},{"$f":"IF(BA32=8,\"\",IF(K32=\"\",\"\",K32))","v":""},{"$f":"L32","v":0},{"$f":"IF(BC32=8,\"\",IF(M32=\"\",\"\",M32))","v":""},{"$f":"N32","v":0},{"$f":"IF(BE32=8,\"\",IF(O32=\"\",\"\",O32))","v":""},{"$f":"P32","v":0},{"$f":"IF(BG32=8,\"\",IF(Q32=\"\",\"\",Q32))","v":""},{"$f":"R32","v":0},{"$f":"IF(BI32=8,\"\",IF(S32=\"\",\"\",S32))","v":""},{"$f":"T32","v":0},{"$f":"IF(BK32=8,\"\",IF(U32=\"\",\"\",U32))","v":""},{"$f":"V32","v":0},{"$f":"IF(BM32=8,\"\",IF(W32=\"\",\"\",W32))","v":""},{"$f":"X32","v":0},{"$f":"IF(BO32=8,\"\",IF(Y32=\"\",\"\",Y32))","v":""},{"$f":"Z32","v":0},{"$f":"IF(BQ32=8,\"\",IF(AA32=\"\",\"\",AA32))","v":""},{"$nulls":3},{"$f":"IF(E32=0,8,IF(E32=\" \",8,D32))","v":8},{"$f":"IF(BV32=8,'JSM Jahresdauerlinie'!$E$26,E32)","v":{"v":1e-06,"d":"0"}},{"$f":"IF(G32=0,8,IF(G32=\" \",8,F32))","v":8},{"$f":"IF(BX32=8,'JSM Jahresdauerlinie'!$E$26,G32)","v":{"v":1e-06,"d":"0"}},{"$f":"IF(I32=0,8,IF(I32=\" \",8,H32))","v":8},{"$f":"IF(BZ32=8,'JSM Jahresdauerlinie'!$E$26,I32)","v":{"v":1e-06,"d":"0"}},{"$f":"IF(K32=0,8,IF(K32=\" \",8,J32))","v":8},{"$f":"IF(CB32=8,'JSM Jahresdauerlinie'!$E$26,K32)","v":{"v":1e-06,"d":"0"}},{"$f":"IF(M32=0,8,IF(M32=\" \",8,L32))","v":8},{"$f":"IF(CD32=8,'JSM Jahresdauerlinie'!$E$26,M32)","v":{"v":1e-06,"d":"0"}},{"$f":"IF(O32=0,8,IF(O32=\" \",8,N32))","v":8},{"$f":"IF(CF32=8,'JSM Jahresdauerlinie'!$E$26,O32)","v":{"v":1e-06,"d":"0"}},{"$f":"IF(Q32=0,8,IF(Q32=\" \",8,P32))","v":8},{"$f":"IF(CH32=8,'JSM Jahresdauerlinie'!$E$26,Q32)","v":{"v":1e-06,"d":"0"}},{"$f":"IF(S32=0,8,IF(S32=\" \",8,R32))","v":8},{"$f":"IF(CJ32=8,'JSM Jahresdauerlinie'!$E$26,S32)","v":{"v":1e-06,"d":"0"}},{"$f":"IF(U32=0,8,IF(U32=\" \",8,T32))","v":8},{"$f":"IF(CL32=8,'JSM Jahresdauerlinie'!$E$26,U32)","v":{"v":1e-06,"d":"0"}},{"$f":"IF(W32=0,8,IF(W32=\" \",8,V32))","v":8},{"$f":"IF(CN32=8,'JSM Jahresdauerlinie'!$E$26,W32)","v":{"v":1e-06,"d":"0"}},{"$f":"IF(Y32=0,8,IF(Y32=\" \",8,X32))","v":8},{"$f":"IF(CP32=8,'JSM Jahresdauerlinie'!$E$26,Y32)","v":{"v":1e-06,"d":"0"}},{"$f":"IF(AA32=0,8,IF(AA32=\" \",8,Z32))","v":8},{"$f":"IF(CR32=8,'JSM Jahresdauerlinie'!$E$26,AA32)","v":{"v":1e-06,"d":"0"}},{"$nulls":3},{"$f":"IF(D32=8,'JSM Jahresdauerlinie'!$E$26,IF(BW32=0,\" \",BW32))","v":{"v":1e-06,"d":"0"}},{"$f":"IF(F32=8,'JSM Jahresdauerlinie'!$E$26,IF(BY32=0,\" \",BY32))","v":{"v":1e-06,"d":"0"}},{"$f":"IF(H32=8,'JSM Jahresdauerlinie'!$E$26,IF(CA32=0,\" \",CA32))","v":{"v":1e-06,"d":"0"}},{"$f":"IF(J32=8,'JSM Jahresdauerlinie'!$E$26,IF(CC32=0,\" \",CC32))","v":{"v":1e-06,"d":"0"}},{"$f":"IF(L32=8,'JSM Jahresdauerlinie'!$E$26,IF(CE32=0,\" \",CE32))","v":{"v":1e-06,"d":"0"}},{"$f":"IF(N32=8,'JSM Jahresdauerlinie'!$E$26,IF(CG32=0,\" \",CG32))","v":{"v":1e-06,"d":"0"}},{"$f":"IF(P32=8,'JSM Jahresdauerlinie'!$E$26,IF(CI32=0,\" \",CI32))","v":{"v":1e-06,"d":"0"}},{"$f":"IF(R32=8,'JSM Jahresdauerlinie'!$E$26,IF(CK32=0,\" \",CK32))","v":{"v":1e-06,"d":"0"}},{"$f":"IF(T32=8,'JSM Jahresdauerlinie'!$E$26,IF(CM32=0,\" \",CM32))","v":{"v":1e-06,"d":"0"}},{"$f":"IF(V32=8,'JSM Jahresdauerlinie'!$E$26,IF(CO32=0,\" \",CO32))","v":{"v":1e-06,"d":"0"}},{"$f":"IF(X32=8,'JSM Jahresdauerlinie'!$E$26,IF(CQ32=0,\" \",CQ32))","v":{"v":1e-06,"d":"0"}},{"$f":"IF(Z32=8,'JSM Jahresdauerlinie'!$E$26,IF(CS32=0,\" \",CS32))","v":{"v":1e-06,"d":"0"}},null,{"$f":"IF(CW32=\" \",$CU$92+0.01,CW32)","v":{"v":1e-06,"d":"0"}},{"v":1e-06,"d":"0"},{"v":1e-06,"d":"0"},{"v":1e-06,"d":"0"},{"v":1e-06,"d":"0"},{"v":1e-06,"d":"0"},{"v":1e-06,"d":"0"},{"v":1e-06,"d":"0"},{"v":1e-06,"d":"0"},{"v":1e-06,"d":"0"},{"v":1e-06,"d":"0"},{"$f":"IF(DH32=\" \",$CU$92+0.01,DH32)","v":{"v":1e-06,"d":"0"}},null,null,{"$f":"BV32","v":8},{"$f":"BX32","v":8},{"$f":"BZ32","v":8},{"$f":"CB32","v":8},{"$f":"CD32","v":8},{"$f":"CF32","v":8},{"$f":"CH32","v":8},{"$f":"CJ32","v":8},{"$f":"CL32","v":8},{"$f":"CN32","v":8},{"$f":"CP32","v":8},{"$f":"CR32","v":8},null,{"$f":"IF(D32=0,\" \",D32)","v":" "},{"$f":"IF(E32=0,\" \",IF(EK32=\" \",\" \",IF(D32<=2,E32,\" \")))","v":" "},{"$f":"IF(F32=0,\" \",F32)","v":" "},{"$f":"IF(G32=0,\" \",IF(EM32=\" \",\" \",IF(F32<=2,G32,\" \")))","v":" "},{"$f":"IF(H32=0,\" \",H32)","v":" "},{"$f":"IF(I32=0,\" \",IF(EO32=\" \",\" \",IF(H32<=2,I32,\" \")))","v":" "},{"$f":"IF(J32=0,\" \",J32)","v":" "},{"$f":"IF(K32=0,\" \",IF(EQ32=\" \",\" \",IF(J32<=2,K32,\" \")))","v":" "},{"$f":"IF(L32=0,\" \",L32)","v":" "},{"$f":"IF(M32=0,\" \",IF(ES32=\" \",\" \",IF(L32<=2,M32,\" \")))","v":" "},{"$f":"IF(N32=0,\" \",N32)","v":" "},{"$f":"IF(O32=0,\" \",IF(EU32=\" \",\" \",IF(N32<=2,O32,\" \")))","v":" "},{"$f":"IF(P32=0,\" \",P32)","v":" "},{"$f":"IF(Q32=0,\" \",IF(EW32=\" \",\" \",IF(P32<=2,Q32,\" \")))","v":" "},{"$f":"IF(R32=0,\" \",R32)","v":" "},{"$f":"IF(S32=0,\" \",IF(EY32=\" \",\" \",IF(R32<=2,S32,\" \")))","v":" "},{"$f":"IF(T32=0,\" \",T32)","v":" "},{"$f":"IF(U32=0,\" \",IF(FA32=\" \",\" \",IF(T32<=2,U32,\" \")))","v":" "},{"$f":"IF(V32=0,\" \",V32)","v":" "},{"$f":"IF(W32=0,\" \",IF(FC32=\" \",\" \",IF(V32<=2,W32,\" \")))","v":" "},{"$f":"IF(X32=0,\" \",X32)","v":" "},{"$f":"IF(Y32=0,\" \",IF(FE32=\" \",\" \",IF(X32<=2,Y32,\" \")))","v":" "},{"$f":"IF(Z32=0,\" \",Z32)","v":" "},{"$f":"IF(AA32=0,\" \",IF(FG32=\" \",\" \",IF(Z32<=2,AA32,\" \")))","v":" "}]
[null,2,{"$nulls":29},{"$f":"IF(E33=0,\" \",IF(E33>0,E33,\" \"))","v":" "}," "," "," "," "," "," "," "," "," "," "," ",{"$nulls":3},{"$f":"D33","v":0},{"$f":"IF(AU33=8,\"\",IF(E33=\"\",\"\",E33))","v":""},0,"",0,"",0,"",0,"",0,"",0,"",0,"",0,"",0,{"$f":"IF(BM33=8,\"\",IF(W33=\"\",\"\",W33))","v":""},0,"",0,"",{"$nulls":3},{"$f":"IF(E33=0,8,IF(E33=\" \",8,D33))","v":8},{"$f":"IF(BV33=8,'JSM Jahresdauerlinie'!$E$26,E33)","v":{"v":1e-06,"d":"0"}},{"$f":"IF(G33=0,8,IF(G33=\" \",8,F33))","v":8},{"$f":"IF(BX33=8,'JSM Jahresdauerlinie'!$E$26,G33)","v":{"v":1e-06,"d":"0"}},{"$f":"IF(I33=0,8,IF(I33=\" \",8,H33))","v":8},{"$f":"IF(BZ33=8,'JSM Jahresdauerlinie'!$E$26,I33)","v":{"v":1e-06,"d":"0"}},{"$f":"IF(K33=0,8,IF(K33=\" \",8,J33))","v":8},{"$f":"IF(CB33=8,'JSM Jahresdauerlinie'!$E$26,K33)","v":{"v":1e-06,"d":"0"}},{"$f":"IF(M33=0,8,IF(M33=\" \",8,L33))","v":8},{"$f":"IF(CD33=8,'JSM Jahresdauerlinie'!$E$26,M33)","v":{"v":1e-06,"d":"0"}},{"$f":"IF(O33=0,8,IF(O33=\" \",8,N33))","v":8},{"$f":"IF(CF33=8,'JSM Jahresdauerlinie'!$E$26,O33)","v":{"v":1e-06,"d":"0"}},{"$f":"IF(Q33=0,8,IF(Q33=\" \",8,P33))","v":8},{"$f":"IF(CH33=8,'JSM Jahresdauerlinie'!$E$26,Q33)","v":{"v":1e-06,"d":"0"}},{"$f":"IF(S33=0,8,IF(S33=\" \",8,R33))","v":8},{"$f":"IF(CJ33=8,'JSM Jahresdauerlinie'!$E$26,S33)","v":{"v":1e-06,"d":"0"}},{"$f":"IF(U33=0,8,IF(U33=\" \",8,T33))","v":8},{"$f":"IF(CL33=8,'JSM Jahresdauerlinie'!$E$26,U33)","v":{"v":1e-06,"d":"0"}},{"$f":"IF(W33=0,8,IF(W33=\" \",8,V33))","v":8},{"$f":"IF(CN33=8,'JSM Jahresdauerlinie'!$E$26,W33)","v":{"v":1e-06,"d":"0"}},{"$f":"IF(Y33=0,8,IF(Y33=\" \",8,X33))","v":8},{"$f":"IF(CP33=8,'JSM Jahresdauerlinie'!$E$26,Y33)","v":{"v":1e-06,"d":"0"}},{"$f":"IF(AA33=0,8,IF(AA33=\" \",8,Z33))","v":8},{"$f":"IF(CR33=8,'JSM Jahresdauerlinie'!$E$26,AA33)","v":{"v":1e-06,"d":"0"}},{"$nulls":3},{"$f":"IF(D33=8,'JSM Jahresdauerlinie'!$E$26,IF(BW33=0,\" \",BW33))","v":{"v":1e-06,"d":"0"}},{"$f":"IF(F33=8,'JSM Jahresdauerlinie'!$E$26,IF(BY33=0,\" \",BY33))","v":{"v":1e-06,"d":"0"}},{"$f":"IF(H33=8,'JSM Jahresdauerlinie'!$E$26,IF(CA33=0,\" \",CA33))","v":{"v":1e-06,"d":"0"}},{"$f":"IF(J33=8,'JSM Jahresdauerlinie'!$E$26,IF(CC33=0,\" \",CC33))","v":{"v":1e-06,"d":"0"}},{"$f":"IF(L33=8,'JSM Jahresdauerlinie'!$E$26,IF(CE33=0,\" \",CE33))","v":{"v":1e-06,"d":"0"}},{"$f":"IF(N33=8,'JSM Jahresdauerlinie'!$E$26,IF(CG33=0,\" \",CG33))","v":{"v":1e-06,"d":"0"}},{"$f":"IF(P33=8,'JSM Jahresdauerlinie'!$E$26,IF(CI33=0,\" \",CI33))","v":{"v":1e-06,"d":"0"}},{"$f":"IF(R33=8,'JSM Jahresdauerlinie'!$E$26,IF(CK33=0,\" \",CK33))","v":{"v":1e-06,"d":"0"}},{"$f":"IF(T33=8,'JSM Jahresdauerlinie'!$E$26,IF(CM33=0,\" \",CM33))","v":{"v":1e-06,"d":"0"}},{"$f":"IF(V33=8,'JSM Jahresdauerlinie'!$E$26,IF(CO33=0,\" \",CO33))","v":{"v":1e-06,"d":"0"}},{"$f":"IF(X33=8,'JSM Jahresdauerlinie'!$E$26,IF(CQ33=0,\" \",CQ33))","v":{"v":1e-06,"d":"0"}},{"$f":"IF(Z33=8,'JSM Jahresdauerlinie'!$E$26,IF(CS33=0,\" \",CS33))","v":{"v":1e-06,"d":"0"}},null,{"$f":"IF(CW33=\" \",$CU$92+0.01,CW33)","v":{"v":1e-06,"d":"0"}},{"$f":"IF(CX33=\" \",$CU$92+0.01,CX33)","v":{"v":1e-06,"d":"0"}},{"$f":"IF(CY33=\" \",$CU$92+0.01,CY33)","v":{"v":1e-06,"d":"0"}},{"$f":"IF(CZ33=\" \",$CU$92+0.01,CZ33)","v":{"v":1e-06,"d":"0"}},{"$f":"IF(DA33=\" \",$CU$92+0.01,DA33)","v":{"v":1e-06,"d":"0"}},{"$f":"IF(DB33=\" \",$CU$92+0.01,DB33)","v":{"v":1e-06,"d":"0"}},{"$f":"IF(DC33=\" \",$CU$92+0.01,DC33)","v":{"v":1e-06,"d":"0"}},{"$f":"IF(DD33=\" \",$CU$92+0.01,DD33)","v":{"v":1e-06,"d":"0"}},{"$f":"IF(DE33=\" \",$CU$92+0.01,DE33)","v":{"v":1e-06,"d":"0"}},{"$f":"IF(DF33=\" \",$CU$92+0.01,DF33)","v":{"v":1e-06,"d":"0"}},{"$f":"IF(DG33=\" \",$CU$92+0.01,DG33)","v":{"v":1e-06,"d":"0"}},{"v":1e-06,"d":"0"},null,null,{"$f":"BV33","v":8},8,8,8,8,8,{"$f":"CH33","v":8},8,8,8,8,8,null,{"$f":"IF(D33=0,\" \",D33)","v":" "},{"$f":"IF(E33=0,\" \",IF(EK33=\" \",\" \",IF(D33<=2,E33,\" \")))","v":" "}," "," "," "," "," "," "," "," "," "," "," "," "," "," "," "," ",{"$f":"IF(V33=0,\" \",V33)","v":" "},{"$f":"IF(W33=0,\" \",IF(FC33=\" \",\" \",IF(V33<=2,W33,\" \")))","v":" "}," "," "," "," "]
[null,3,{"$nulls":29}," "," "," "," "," "," "," "," "," "," "," "," ",{"$nulls":3},0,"",0,"",0,"",0,"",0,"",0,"",0,"",0,"",0,"",0,"",0,"",0,"",{"$nulls":3},8,{"$f":"IF(BV34=8,'JSM Jahresdauerlinie'!$E$26,E34)","v":{"v":1e-06,"d":"0"}},8,{"$f":"IF(BX34=8,'JSM Jahresdauerlinie'!$E$26,G34)","v":{"v":1e-06,"d":"0"}},8,{"$f":"IF(BZ34=8,'JSM Jahresdauerlinie'!$E$26,I34)","v":{"v":1e-06,"d":"0"}},8,{"$f":"IF(CB34=8,'JSM Jahresdauerlinie'!$E$26,K34)","v":{"v":1e-06,"d":"0"}},8,{"$f":"IF(CD34=8,'JSM Jahresdauerlinie'!$E$26,M34)","v":{"v":1e-06,"d":"0"}},8,{"$f":"IF(CF34=8,'JSM Jahresdauerlinie'!$E$26,O34)","v":{"v":1e-06,"d":"0"}},8,{"$f":"IF(CH34=8,'JSM Jahresdauerlinie'!$E$26,Q34)","v":{"v":1e-06,"d":"0"}},8,{"$f":"IF(CJ34=8,'JSM Jahresdauerlinie'!$E$26,S34)","v":{"v":1e-06,"d":"0"}},8,{"$f":"IF(CL34=8,'JSM Jahresdauerlinie'!$E$26,U34)","v":{"v":1e-06,"d":"0"}},8,{"$f":"IF(CN34=8,'JSM Jahresdauerlinie'!$E$26,W34)","v":{"v":1e-06,"d":"0"}},8,{"$f":"IF(CP34=8,'JSM Jahresdauerlinie'!$E$26,Y34)","v":{"v":1e-06,"d":"0"}},8,{"$f":"IF(CR34=8,'JSM Jahresdauerlinie'!$E$26,AA34)","v":{"v":1e-06,"d":"0"}},{"$nulls":3},{"$f":"IF(D34=8,'JSM Jahresdauerlinie'!$E$26,IF(BW34=0,\" \",BW34))","v":{"v":1e-06,"d":"0"}},{"$f":"IF(F34=8,'JSM Jahresdauerlinie'!$E$26,IF(BY34=0,\" \",BY34))","v":{"v":1e-06,"d":"0"}},{"$f":"IF(H34=8,'JSM Jahresdauerlinie'!$E$26,IF(CA34=0,\" \",CA34))","v":{"v":1e-06,"d":"0"}},{"$f":"IF(J34=8,'JSM Jahresdauerlinie'!$E$26,IF(CC34=0,\" \",CC34))","v":{"v":1e-06,"d":"0"}},{"$f":"IF(L34=8,'JSM Jahresdauerlinie'!$E$26,IF(CE34=0,\" \",CE34))","v":{"v":1e-06,"d":"0"}},{"$f":"IF(N34=8,'JSM Jahresdauerlinie'!$E$26,IF(CG34=0,\" \",CG34))","v":{"v":1e-06,"d":"0"}},{"$f":"IF(P34=8,'JSM Jahresdauerlinie'!$E$26,IF(CI34=0,\" \",CI34))","v":{"v":1e-06,"d":"0"}},{"$f":"IF(R34=8,'JSM Jahresdauerlinie'!$E$26,IF(CK34=0,\" \",CK34))","v":{"v":1e-06,"d":"0"}},{"$f":"IF(T34=8,'JSM Jahresdauerlinie'!$E$26,IF(CM34=0,\" \",CM34))","v":{"v":1e-06,"d":"0"}},{"$f":"IF(V34=8,'JSM Jahresdauerlinie'!$E$26,IF(CO34=0,\" \",CO34))","v":{"v":1e-06,"d":"0"}},{"$f":"IF(X34=8,'JSM Jahresdauerlinie'!$E$26,IF(CQ34=0,\" \",CQ34))","v":{"v":1e-06,"d":"0"}},{"$f":"IF(Z34=8,'JSM Jahresdauerlinie'!$E$26,IF(CS34=0,\" \",CS34))","v":{"v":1e-06,"d":"0"}},null,{"v":1e-06,"d":"0"},{"v":1e-06,"d":"0"},{"v":1e-06,"d":"0"},{"v":1e-06,"d":"0"},{"v":1e-06,"d":"0"},{"v":1e-06,"d":"0"},{"v":1e-06,"d":"0"},{"v":1e-06,"d":"0"},{"v":1e-06,"d":"0"},{"v":1e-06,"d":"0"},{"v":1e-06,"d":"0"},{"v":1e-06,"d":"0"},null,null,8,8,8,8,8,8,8,8,8,8,8,8,null," "," "," "," "," "," "," "," "," "," "," "," "," "," "," "," "," "," "," "," "," "," "," "," "]
[null,4,{"$nulls":29}," "," "," "," "," "," "," "," "," "," "," "," ",{"$nulls":3},0,"",0,"",0,"",0,"",0,"",0,"",0,"",0,"",0,"",0,"",0,"",0,"",{"$nulls":3},8,{"$f":"IF(BV35=8,'JSM Jahresdauerlinie'!$E$26,E35)","v":{"v":1e-06,"d":"0"}},8,{"$f":"IF(BX35=8,'JSM Jahresdauerlinie'!$E$26,G35)","v":{"v":1e-06,"d":"0"}},8,{"$f":"IF(BZ35=8,'JSM Jahresdauerlinie'!$E$26,I35)","v":{"v":1e-06,"d":"0"}},8,{"$f":"IF(CB35=8,'JSM Jahresdauerlinie'!$E$26,K35)","v":{"v":1e-06,"d":"0"}},8,{"$f":"IF(CD35=8,'JSM Jahresdauerlinie'!$E$26,M35)","v":{"v":1e-06,"d":"0"}},8,{"$f":"IF(CF35=8,'JSM Jahresdauerlinie'!$E$26,O35)","v":{"v":1e-06,"d":"0"}},8,{"$f":"IF(CH35=8,'JSM Jahresdauerlinie'!$E$26,Q35)","v":{"v":1e-06,"d":"0"}},8,{"$f":"IF(CJ35=8,'JSM Jahresdauerlinie'!$E$26,S35)","v":{"v":1e-06,"d":"0"}},8,{"$f":"IF(CL35=8,'JSM Jahresdauerlinie'!$E$26,U35)","v":{"v":1e-06,"d":"0"}},8,{"$f":"IF(CN35=8,'JSM Jahresdauerlinie'!$E$26,W35)","v":{"v":1e-06,"d":"0"}},8,{"$f":"IF(CP35=8,'JSM Jahresdauerlinie'!$E$26,Y35)","v":{"v":1e-06,"d":"0"}},8,{"$f":"IF(CR35=8,'JSM Jahresdauerlinie'!$E$26,AA35)","v":{"v":1e-06,"d":"0"}},{"$nulls":3},{"$f":"IF(D35=8,'JSM Jahresdauerlinie'!$E$26,IF(BW35=0,\" \",BW35))","v":{"v":1e-06,"d":"0"}},{"$f":"IF(F35=8,'JSM Jahresdauerlinie'!$E$26,IF(BY35=0,\" \",BY35))","v":{"v":1e-06,"d":"0"}},{"$f":"IF(H35=8,'JSM Jahresdauerlinie'!$E$26,IF(CA35=0,\" \",CA35))","v":{"v":1e-06,"d":"0"}},{"$f":"IF(J35=8,'JSM Jahresdauerlinie'!$E$26,IF(CC35=0,\" \",CC35))","v":{"v":1e-06,"d":"0"}},{"$f":"IF(L35=8,'JSM Jahresdauerlinie'!$E$26,IF(CE35=0,\" \",CE35))","v":{"v":1e-06,"d":"0"}},{"$f":"IF(N35=8,'JSM Jahresdauerlinie'!$E$26,IF(CG35=0,\" \",CG35))","v":{"v":1e-06,"d":"0"}},{"$f":"IF(P35=8,'JSM Jahresdauerlinie'!$E$26,IF(CI35=0,\" \",CI35))","v":{"v":1e-06,"d":"0"}},{"$f":"IF(R35=8,'JSM Jahresdauerlinie'!$E$26,IF(CK35=0,\" \",CK35))","v":{"v":1e-06,"d":"0"}},{"$f":"IF(T35=8,'JSM Jahresdauerlinie'!$E$26,IF(CM35=0,\" \",CM35))","v":{"v":1e-06,"d":"0"}},{"$f":"IF(V35=8,'JSM Jahresdauerlinie'!$E$26,IF(CO35=0,\" \",CO35))","v":{"v":1e-06,"d":"0"}},{"$f":"IF(X35=8,'JSM Jahresdauerlinie'!$E$26,IF(CQ35=0,\" \",CQ35))","v":{"v":1e-06,"d":"0"}},{"$f":"IF(Z35=8,'JSM Jahresdauerlinie'!$E$26,IF(CS35=0,\" \",CS35))","v":{"v":1e-06,"d":"0"}},null,{"v":1e-06,"d":"0"},{"v":1e-06,"d":"0"},{"v":1e-06,"d":"0"},{"v":1e-06,"d":"0"},{"v":1e-06,"d":"0"},{"v":1e-06,"d":"0"},{"v":1e-06,"d":"0"},{"v":1e-06,"d":"0"},{"v":1e-06,"d":"0"},{"v":1e-06,"d":"0"},{"v":1e-06,"d":"0"},{"v":1e-06,"d":"0"},null,null,8,8,8,8,8,8,8,8,8,8,8,8,null," "," "," "," "," "," "," "," "," "," "," "," "," "," "," "," "," "," "," "," "," "," "," "," "]
[null,5,{"$nulls":29}," "," "," "," "," "," "," "," "," "," "," "," ",{"$nulls":3},0,"",0,"",0,"",0,"",0,"",0,"",0,"",0,"",0,"",0,"",0,"",0,"",{"$nulls":3},8,{"$f":"IF(BV36=8,'JSM Jahresdauerlinie'!$E$26,E36)","v":{"v":1e-06,"d":"0"}},8,{"$f":"IF(BX36=8,'JSM Jahresdauerlinie'!$E$26,G36)","v":{"v":1e-06,"d":"0"}},8,{"$f":"IF(BZ36=8,'JSM Jahresdauerlinie'!$E$26,I36)","v":{"v":1e-06,"d":"0"}},8,{"$f":"IF(CB36=8,'JSM Jahresdauerlinie'!$E$26,K36)","v":{"v":1e-06,"d":"0"}},8,{"$f":"IF(CD36=8,'JSM Jahresdauerlinie'!$E$26,M36)","v":{"v":1e-06,"d":"0"}},8,{"$f":"IF(CF36=8,'JSM Jahresdauerlinie'!$E$26,O36)","v":{"v":1e-06,"d":"0"}},8,{"$f":"IF(CH36=8,'JSM Jahresdauerlinie'!$E$26,Q36)","v":{"v":1e-06,"d":"0"}},8,{"$f":"IF(CJ36=8,'JSM Jahresdauerlinie'!$E$26,S36)","v":{"v":1e-06,"d":"0"}},8,{"$f":"IF(CL36=8,'JSM Jahresdauerlinie'!$E$26,U36)","v":{"v":1e-06,"d":"0"}},8,{"$f":"IF(CN36=8,'JSM Jahresdauerlinie'!$E$26,W36)","v":{"v":1e-06,"d":"0"}},8,{"$f":"IF(CP36=8,'JSM Jahresdauerlinie'!$E$26,Y36)","v":{"v":1e-06,"d":"0"}},8,{"$f":"IF(CR36=8,'JSM Jahresdauerlinie'!$E$26,AA36)","v":{"v":1e-06,"d":"0"}},{"$nulls":3},{"$f":"IF(D36=8,'JSM Jahresdauerlinie'!$E$26,IF(BW36=0,\" \",BW36))","v":{"v":1e-06,"d":"0"}},{"$f":"IF(F36=8,'JSM Jahresdauerlinie'!$E$26,IF(BY36=0,\" \",BY36))","v":{"v":1e-06,"d":"0"}},{"$f":"IF(H36=8,'JSM Jahresdauerlinie'!$E$26,IF(CA36=0,\" \",CA36))","v":{"v":1e-06,"d":"0"}},{"$f":"IF(J36=8,'JSM Jahresdauerlinie'!$E$26,IF(CC36=0,\" \",CC36))","v":{"v":1e-06,"d":"0"}},{"$f":"IF(L36=8,'JSM Jahresdauerlinie'!$E$26,IF(CE36=0,\" \",CE36))","v":{"v":1e-06,"d":"0"}},{"$f":"IF(N36=8,'JSM Jahresdauerlinie'!$E$26,IF(CG36=0,\" \",CG36))","v":{"v":1e-06,"d":"0"}},{"$f":"IF(P36=8,'JSM Jahresdauerlinie'!$E$26,IF(CI36=0,\" \",CI36))","v":{"v":1e-06,"d":"0"}},{"$f":"IF(R36=8,'JSM Jahresdauerlinie'!$E$26,IF(CK36=0,\" \",CK36))","v":{"v":1e-06,"d":"0"}},{"$f":"IF(T36=8,'JSM Jahresdauerlinie'!$E$26,IF(CM36=0,\" \",CM36))","v":{"v":1e-06,"d":"0"}},{"$f":"IF(V36=8,'JSM Jahresdauerlinie'!$E$26,IF(CO36=0,\" \",CO36))","v":{"v":1e-06,"d":"0"}},{"$f":"IF(X36=8,'JSM Jahresdauerlinie'!$E$26,IF(CQ36=0,\" \",CQ36))","v":{"v":1e-06,"d":"0"}},{"$f":"IF(Z36=8,'JSM Jahresdauerlinie'!$E$26,IF(CS36=0,\" \",CS36))","v":{"v":1e-06,"d":"0"}},null,{"v":1e-06,"d":"0"},{"v":1e-06,"d":"0"},{"v":1e-06,"d":"0"},{"v":1e-06,"d":"0"},{"v":1e-06,"d":"0"},{"v":1e-06,"d":"0"},{"v":1e-06,"d":"0"},{"v":1e-06,"d":"0"},{"v":1e-06,"d":"0"},{"v":1e-06,"d":"0"},{"v":1e-06,"d":"0"},{"v":1e-06,"d":"0"},null,null,8,8,8,8,8,8,8,8,8,8,8,8,null," "," "," "," "," "," "," "," "," "," "," "," "," "," "," "," "," "," "," "," "," "," "," "," "]
[null,6,{"$nulls":29}," "," "," "," "," "," "," "," "," "," "," "," ",{"$nulls":3},0,"",0,"",0,"",0,"",0,"",0,"",0,"",0,"",0,"",0,"",0,"",0,"",{"$nulls":3},8,{"$f":"IF(BV37=8,'JSM Jahresdauerlinie'!$E$26,E37)","v":{"v":1e-06,"d":"0"}},8,{"$f":"IF(BX37=8,'JSM Jahresdauerlinie'!$E$26,G37)","v":{"v":1e-06,"d":"0"}},8,{"$f":"IF(BZ37=8,'JSM Jahresdauerlinie'!$E$26,I37)","v":{"v":1e-06,"d":"0"}},8,{"$f":"IF(CB37=8,'JSM Jahresdauerlinie'!$E$26,K37)","v":{"v":1e-06,"d":"0"}},8,{"$f":"IF(CD37=8,'JSM Jahresdauerlinie'!$E$26,M37)","v":{"v":1e-06,"d":"0"}},8,{"$f":"IF(CF37=8,'JSM Jahresdauerlinie'!$E$26,O37)","v":{"v":1e-06,"d":"0"}},8,{"$f":"IF(CH37=8,'JSM Jahresdauerlinie'!$E$26,Q37)","v":{"v":1e-06,"d":"0"}},8,{"$f":"IF(CJ37=8,'JSM Jahresdauerlinie'!$E$26,S37)","v":{"v":1e-06,"d":"0"}},8,{"$f":"IF(CL37=8,'JSM Jahresdauerlinie'!$E$26,U37)","v":{"v":1e-06,"d":"0"}},8,{"$f":"IF(CN37=8,'JSM Jahresdauerlinie'!$E$26,W37)","v":{"v":1e-06,"d":"0"}},8,{"$f":"IF(CP37=8,'JSM Jahresdauerlinie'!$E$26,Y37)","v":{"v":1e-06,"d":"0"}},8,{"$f":"IF(CR37=8,'JSM Jahresdauerlinie'!$E$26,AA37)","v":{"v":1e-06,"d":"0"}},{"$nulls":3},{"$f":"IF(D37=8,'JSM Jahresdauerlinie'!$E$26,IF(BW37=0,\" \",BW37))","v":{"v":1e-06,"d":"0"}},{"$f":"IF(F37=8,'JSM Jahresdauerlinie'!$E$26,IF(BY37=0,\" \",BY37))","v":{"v":1e-06,"d":"0"}},{"$f":"IF(H37=8,'JSM Jahresdauerlinie'!$E$26,IF(CA37=0,\" \",CA37))","v":{"v":1e-06,"d":"0"}},{"$f":"IF(J37=8,'JSM Jahresdauerlinie'!$E$26,IF(CC37=0,\" \",CC37))","v":{"v":1e-06,"d":"0"}},{"$f":"IF(L37=8,'JSM Jahresdauerlinie'!$E$26,IF(CE37=0,\" \",CE37))","v":{"v":1e-06,"d":"0"}},{"$f":"IF(N37=8,'JSM Jahresdauerlinie'!$E$26,IF(CG37=0,\" \",CG37))","v":{"v":1e-06,"d":"0"}},{"$f":"IF(P37=8,'JSM Jahresdauerlinie'!$E$26,IF(CI37=0,\" \",CI37))","v":{"v":1e-06,"d":"0"}},{"$f":"IF(R37=8,'JSM Jahresdauerlinie'!$E$26,IF(CK37=0,\" \",CK37))","v":{"v":1e-06,"d":"0"}},{"$f":"IF(T37=8,'JSM Jahresdauerlinie'!$E$26,IF(CM37=0,\" \",CM37))","v":{"v":1e-06,"d":"0"}},{"$f":"IF(V37=8,'JSM Jahresdauerlinie'!$E$26,IF(CO37=0,\" \",CO37))","v":{"v":1e-06,"d":"0"}},{"$f":"IF(X37=8,'JSM Jahresdauerlinie'!$E$26,IF(CQ37=0,\" \",CQ37))","v":{"v":1e-06,"d":"0"}},{"$f":"IF(Z37=8,'JSM Jahresdauerlinie'!$E$26,IF(CS37=0,\" \",CS37))","v":{"v":1e-06,"d":"0"}},null,{"v":1e-06,"d":"0"},{"v":1e-06,"d":"0"},{"v":1e-06,"d":"0"},{"v":1e-06,"d":"0"},{"v":1e-06,"d":"0"},{"v":1e-06,"d":"0"},{"v":1e-06,"d":"0"},{"v":1e-06,"d":"0"},{"v":1e-06,"d":"0"},{"v":1e-06,"d":"0"},{"v":1e-06,"d":"0"},{"v":1e-06,"d":"0"},null,null,8,8,8,8,8,8,8,8,8,8,8,8,null," "," "," "," "," "," "," "," "," "," "," "," "," "," "," "," "," "," "," "," "," "," "," "," "]
[null,7,{"$nulls":29}," "," "," "," "," "," "," "," "," "," "," "," ",{"$nulls":3},0,"",0,"",0,"",0,"",0,"",0,"",0,"",0,"",0,"",0,"",0,"",0,"",{"$nulls":3},8,{"$f":"IF(BV38=8,'JSM Jahresdauerlinie'!$E$26,E38)","v":{"v":1e-06,"d":"0"}},8,{"$f":"IF(BX38=8,'JSM Jahresdauerlinie'!$E$26,G38)","v":{"v":1e-06,"d":"0"}},8,{"$f":"IF(BZ38=8,'JSM Jahresdauerlinie'!$E$26,I38)","v":{"v":1e-06,"d":"0"}},8,{"$f":"IF(CB38=8,'JSM Jahresdauerlinie'!$E$26,K38)","v":{"v":1e-06,"d":"0"}},8,{"$f":"IF(CD38=8,'JSM Jahresdauerlinie'!$E$26,M38)","v":{"v":1e-06,"d":"0"}},8,{"$f":"IF(CF38=8,'JSM Jahresdauerlinie'!$E$26,O38)","v":{"v":1e-06,"d":"0"}},8,{"$f":"IF(CH38=8,'JSM Jahresdauerlinie'!$E$26,Q38)","v":{"v":1e-06,"d":"0"}},8,{"$f":"IF(CJ38=8,'JSM Jahresdauerlinie'!$E$26,S38)","v":{"v":1e-06,"d":"0"}},8,{"$f":"IF(CL38=8,'JSM Jahresdauerlinie'!$E$26,U38)","v":{"v":1e-06,"d":"0"}},8,{"$f":"IF(CN38=8,'JSM Jahresdauerlinie'!$E$26,W38)","v":{"v":1e-06,"d":"0"}},8,{"$f":"IF(CP38=8,'JSM Jahresdauerlinie'!$E$26,Y38)","v":{"v":1e-06,"d":"0"}},8,{"$f":"IF(CR38=8,'JSM Jahresdauerlinie'!$E$26,AA38)","v":{"v":1e-06,"d":"0"}},{"$nulls":3},{"$f":"IF(D38=8,'JSM Jahresdauerlinie'!$E$26,IF(BW38=0,\" \",BW38))","v":{"v":1e-06,"d":"0"}},{"$f":"IF(F38=8,'JSM Jahresdauerlinie'!$E$26,IF(BY38=0,\" \",BY38))","v":{"v":1e-06,"d":"0"}},{"$f":"IF(H38=8,'JSM Jahresdauerlinie'!$E$26,IF(CA38=0,\" \",CA38))","v":{"v":1e-06,"d":"0"}},{"$f":"IF(J38=8,'JSM Jahresdauerlinie'!$E$26,IF(CC38=0,\" \",CC38))","v":{"v":1e-06,"d":"0"}},{"$f":"IF(L38=8,'JSM Jahresdauerlinie'!$E$26,IF(CE38=0,\" \",CE38))","v":{"v":1e-06,"d":"0"}},{"$f":"IF(N38=8,'JSM Jahresdauerlinie'!$E$26,IF(CG38=0,\" \",CG38))","v":{"v":1e-06,"d":"0"}},{"$f":"IF(P38=8,'JSM Jahresdauerlinie'!$E$26,IF(CI38=0,\" \",CI38))","v":{"v":1e-06,"d":"0"}},{"$f":"IF(R38=8,'JSM Jahresdauerlinie'!$E$26,IF(CK38=0,\" \",CK38))","v":{"v":1e-06,"d":"0"}},{"$f":"IF(T38=8,'JSM Jahresdauerlinie'!$E$26,IF(CM38=0,\" \",CM38))","v":{"v":1e-06,"d":"0"}},{"$f":"IF(V38=8,'JSM Jahresdauerlinie'!$E$26,IF(CO38=0,\" \",CO38))","v":{"v":1e-06,"d":"0"}},{"$f":"IF(X38=8,'JSM Jahresdauerlinie'!$E$26,IF(CQ38=0,\" \",CQ38))","v":{"v":1e-06,"d":"0"}},{"$f":"IF(Z38=8,'JSM Jahresdauerlinie'!$E$26,IF(CS38=0,\" \",CS38))","v":{"v":1e-06,"d":"0"}},null,{"v":1e-06,"d":"0"},{"v":1e-06,"d":"0"},{"v":1e-06,"d":"0"},{"v":1e-06,"d":"0"},{"v":1e-06,"d":"0"},{"v":1e-06,"d":"0"},{"v":1e-06,"d":"0"},{"v":1e-06,"d":"0"},{"v":1e-06,"d":"0"},{"v":1e-06,"d":"0"},{"v":1e-06,"d":"0"},{"v":1e-06,"d":"0"},null,null,8,8,8,8,8,8,8,8,8,8,8,8,null," "," "," "," "," "," "," "," "," "," "," "," "," "," "," "," "," "," "," "," "," "," "," "," "]
[null,8,{"$nulls":29}," "," "," "," "," "," "," "," "," "," "," "," ",{"$nulls":3},0,"",0,"",0,"",0,"",0,"",0,"",0,"",0,"",0,"",0,"",0,"",0,"",{"$nulls":3},8,{"$f":"IF(BV39=8,'JSM Jahresdauerlinie'!$E$26,E39)","v":{"v":1e-06,"d":"0"}},8,{"$f":"IF(BX39=8,'JSM Jahresdauerlinie'!$E$26,G39)","v":{"v":1e-06,"d":"0"}},8,{"$f":"IF(BZ39=8,'JSM Jahresdauerlinie'!$E$26,I39)","v":{"v":1e-06,"d":"0"}},8,{"$f":"IF(CB39=8,'JSM Jahresdauerlinie'!$E$26,K39)","v":{"v":1e-06,"d":"0"}},8,{"$f":"IF(CD39=8,'JSM Jahresdauerlinie'!$E$26,M39)","v":{"v":1e-06,"d":"0"}},8,{"$f":"IF(CF39=8,'JSM Jahresdauerlinie'!$E$26,O39)","v":{"v":1e-06,"d":"0"}},8,{"$f":"IF(CH39=8,'JSM Jahresdauerlinie'!$E$26,Q39)","v":{"v":1e-06,"d":"0"}},8,{"$f":"IF(CJ39=8,'JSM Jahresdauerlinie'!$E$26,S39)","v":{"v":1e-06,"d":"0"}},8,{"$f":"IF(CL39=8,'JSM Jahresdauerlinie'!$E$26,U39)","v":{"v":1e-06,"d":"0"}},8,{"$f":"IF(CN39=8,'JSM Jahresdauerlinie'!$E$26,W39)","v":{"v":1e-06,"d":"0"}},8,{"$f":"IF(CP39=8,'JSM Jahresdauerlinie'!$E$26,Y39)","v":{"v":1e-06,"d":"0"}},8,{"$f":"IF(CR39=8,'JSM Jahresdauerlinie'!$E$26,AA39)","v":{"v":1e-06,"d":"0"}},{"$nulls":3},{"$f":"IF(D39=8,'JSM Jahresdauerlinie'!$E$26,IF(BW39=0,\" \",BW39))","v":{"v":1e-06,"d":"0"}},{"$f":"IF(F39=8,'JSM Jahresdauerlinie'!$E$26,IF(BY39=0,\" \",BY39))","v":{"v":1e-06,"d":"0"}},{"$f":"IF(H39=8,'JSM Jahresdauerlinie'!$E$26,IF(CA39=0,\" \",CA39))","v":{"v":1e-06,"d":"0"}},{"$f":"IF(J39=8,'JSM Jahresdauerlinie'!$E$26,IF(CC39=0,\" \",CC39))","v":{"v":1e-06,"d":"0"}},{"$f":"IF(L39=8,'JSM Jahresdauerlinie'!$E$26,IF(CE39=0,\" \",CE39))","v":{"v":1e-06,"d":"0"}},{"$f":"IF(N39=8,'JSM Jahresdauerlinie'!$E$26,IF(CG39=0,\" \",CG39))","v":{"v":1e-06,"d":"0"}},{"$f":"IF(P39=8,'JSM Jahresdauerlinie'!$E$26,IF(CI39=0,\" \",CI39))","v":{"v":1e-06,"d":"0"}},{"$f":"IF(R39=8,'JSM Jahresdauerlinie'!$E$26,IF(CK39=0,\" \",CK39))","v":{"v":1e-06,"d":"0"}},{"$f":"IF(T39=8,'JSM Jahresdauerlinie'!$E$26,IF(CM39=0,\" \",CM39))","v":{"v":1e-06,"d":"0"}},{"$f":"IF(V39=8,'JSM Jahresdauerlinie'!$E$26,IF(CO39=0,\" \",CO39))","v":{"v":1e-06,"d":"0"}},{"$f":"IF(X39=8,'JSM Jahresdauerlinie'!$E$26,IF(CQ39=0,\" \",CQ39))","v":{"v":1e-06,"d":"0"}},{"$f":"IF(Z39=8,'JSM Jahresdauerlinie'!$E$26,IF(CS39=0,\" \",CS39))","v":{"v":1e-06,"d":"0"}},null,{"v":1e-06,"d":"0"},{"v":1e-06,"d":"0"},{"v":1e-06,"d":"0"},{"v":1e-06,"d":"0"},{"v":1e-06,"d":"0"},{"v":1e-06,"d":"0"},{"v":1e-06,"d":"0"},{"v":1e-06,"d":"0"},{"v":1e-06,"d":"0"},{"v":1e-06,"d":"0"},{"v":1e-06,"d":"0"},{"v":1e-06,"d":"0"},null,null,8,8,8,8,8,8,8,8,8,8,8,8,null," "," "," "," "," "," "," "," "," "," "," "," "," "," "," "," "," "," "," "," "," "," "," "," "]
[null,9,{"$nulls":29}," "," "," "," "," "," "," "," "," "," "," "," ",{"$nulls":3},0,"",0,"",0,"",0,"",0,"",0,"",0,"",0,"",0,"",0,"",0,"",0,"",{"$nulls":3},8,{"$f":"IF(BV40=8,'JSM Jahresdauerlinie'!$E$26,E40)","v":{"v":1e-06,"d":"0"}},8,{"$f":"IF(BX40=8,'JSM Jahresdauerlinie'!$E$26,G40)","v":{"v":1e-06,"d":"0"}},8,{"$f":"IF(BZ40=8,'JSM Jahresdauerlinie'!$E$26,I40)","v":{"v":1e-06,"d":"0"}},8,{"$f":"IF(CB40=8,'JSM Jahresdauerlinie'!$E$26,K40)","v":{"v":1e-06,"d":"0"}},8,{"$f":"IF(CD40=8,'JSM Jahresdauerlinie'!$E$26,M40)","v":{"v":1e-06,"d":"0"}},8,{"$f":"IF(CF40=8,'JSM Jahresdauerlinie'!$E$26,O40)","v":{"v":1e-06,"d":"0"}},8,{"$f":"IF(CH40=8,'JSM Jahresdauerlinie'!$E$26,Q40)","v":{"v":1e-06,"d":"0"}},8,{"$f":"IF(CJ40=8,'JSM Jahresdauerlinie'!$E$26,S40)","v":{"v":1e-06,"d":"0"}},8,{"$f":"IF(CL40=8,'JSM Jahresdauerlinie'!$E$26,U40)","v":{"v":1e-06,"d":"0"}},8,{"$f":"IF(CN40=8,'JSM Jahresdauerlinie'!$E$26,W40)","v":{"v":1e-06,"d":"0"}},8,{"$f":"IF(CP40=8,'JSM Jahresdauerlinie'!$E$26,Y40)","v":{"v":1e-06,"d":"0"}},8,{"$f":"IF(CR40=8,'JSM Jahresdauerlinie'!$E$26,AA40)","v":{"v":1e-06,"d":"0"}},{"$nulls":3},{"$f":"IF(D40=8,'JSM Jahresdauerlinie'!$E$26,IF(BW40=0,\" \",BW40))","v":{"v":1e-06,"d":"0"}},{"$f":"IF(F40=8,'JSM Jahresdauerlinie'!$E$26,IF(BY40=0,\" \",BY40))","v":{"v":1e-06,"d":"0"}},{"$f":"IF(H40=8,'JSM Jahresdauerlinie'!$E$26,IF(CA40=0,\" \",CA40))","v":{"v":1e-06,"d":"0"}},{"$f":"IF(J40=8,'JSM Jahresdauerlinie'!$E$26,IF(CC40=0,\" \",CC40))","v":{"v":1e-06,"d":"0"}},{"$f":"IF(L40=8,'JSM Jahresdauerlinie'!$E$26,IF(CE40=0,\" \",CE40))","v":{"v":1e-06,"d":"0"}},{"$f":"IF(N40=8,'JSM Jahresdauerlinie'!$E$26,IF(CG40=0,\" \",CG40))","v":{"v":1e-06,"d":"0"}},{"$f":"IF(P40=8,'JSM Jahresdauerlinie'!$E$26,IF(CI40=0,\" \",CI40))","v":{"v":1e-06,"d":"0"}},{"$f":"IF(R40=8,'JSM Jahresdauerlinie'!$E$26,IF(CK40=0,\" \",CK40))","v":{"v":1e-06,"d":"0"}},{"$f":"IF(T40=8,'JSM Jahresdauerlinie'!$E$26,IF(CM40=0,\" \",CM40))","v":{"v":1e-06,"d":"0"}},{"$f":"IF(V40=8,'JSM Jahresdauerlinie'!$E$26,IF(CO40=0,\" \",CO40))","v":{"v":1e-06,"d":"0"}},{"$f":"IF(X40=8,'JSM Jahresdauerlinie'!$E$26,IF(CQ40=0,\" \",CQ40))","v":{"v":1e-06,"d":"0"}},{"$f":"IF(Z40=8,'JSM Jahresdauerlinie'!$E$26,IF(CS40=0,\" \",CS40))","v":{"v":1e-06,"d":"0"}},null,{"v":1e-06,"d":"0"},{"v":1e-06,"d":"0"},{"v":1e-06,"d":"0"},{"v":1e-06,"d":"0"},{"v":1e-06,"d":"0"},{"v":1e-06,"d":"0"},{"v":1e-06,"d":"0"},{"v":1e-06,"d":"0"},{"v":1e-06,"d":"0"},{"v":1e-06,"d":"0"},{"v":1e-06,"d":"0"},{"v":1e-06,"d":"0"},null,null,8,8,8,8,8,8,8,8,8,8,8,8,null," "," "," "," "," "," "," "," "," "," "," "," "," "," "," "," "," "," "," "," "," "," "," "," "]
[null,10,{"$nulls":29}," "," "," "," "," "," "," "," "," "," "," "," ",{"$nulls":3},0,"",0,"",0,"",0,"",0,"",0,"",0,"",0,"",0,"",0,"",0,"",0,"",{"$nulls":3},8,{"$f":"IF(BV41=8,'JSM Jahresdauerlinie'!$E$26,E41)","v":{"v":1e-06,"d":"0"}},8,{"$f":"IF(BX41=8,'JSM Jahresdauerlinie'!$E$26,G41)","v":{"v":1e-06,"d":"0"}},8,{"$f":"IF(BZ41=8,'JSM Jahresdauerlinie'!$E$26,I41)","v":{"v":1e-06,"d":"0"}},8,{"$f":"IF(CB41=8,'JSM Jahresdauerlinie'!$E$26,K41)","v":{"v":1e-06,"d":"0"}},8,{"$f":"IF(CD41=8,'JSM Jahresdauerlinie'!$E$26,M41)","v":{"v":1e-06,"d":"0"}},8,{"$f":"IF(CF41=8,'JSM Jahresdauerlinie'!$E$26,O41)","v":{"v":1e-06,"d":"0"}},8,{"$f":"IF(CH41=8,'JSM Jahresdauerlinie'!$E$26,Q41)","v":{"v":1e-06,"d":"0"}},8,{"$f":"IF(CJ41=8,'JSM Jahresdauerlinie'!$E$26,S41)","v":{"v":1e-06,"d":"0"}},8,{"$f":"IF(CL41=8,'JSM Jahresdauerlinie'!$E$26,U41)","v":{"v":1e-06,"d":"0"}},8,{"$f":"IF(CN41=8,'JSM Jahresdauerlinie'!$E$26,W41)","v":{"v":1e-06,"d":"0"}},8,{"$f":"IF(CP41=8,'JSM Jahresdauerlinie'!$E$26,Y41)","v":{"v":1e-06,"d":"0"}},8,{"$f":"IF(CR41=8,'JSM Jahresdauerlinie'!$E$26,AA41)","v":{"v":1e-06,"d":"0"}},{"$nulls":3},{"$f":"IF(D41=8,'JSM Jahresdauerlinie'!$E$26,IF(BW41=0,\" \",BW41))","v":{"v":1e-06,"d":"0"}},{"$f":"IF(F41=8,'JSM Jahresdauerlinie'!$E$26,IF(BY41=0,\" \",BY41))","v":{"v":1e-06,"d":"0"}},{"$f":"IF(H41=8,'JSM Jahresdauerlinie'!$E$26,IF(CA41=0,\" \",CA41))","v":{"v":1e-06,"d":"0"}},{"$f":"IF(J41=8,'JSM Jahresdauerlinie'!$E$26,IF(CC41=0,\" \",CC41))","v":{"v":1e-06,"d":"0"}},{"$f":"IF(L41=8,'JSM Jahresdauerlinie'!$E$26,IF(CE41=0,\" \",CE41))","v":{"v":1e-06,"d":"0"}},{"$f":"IF(N41=8,'JSM Jahresdauerlinie'!$E$26,IF(CG41=0,\" \",CG41))","v":{"v":1e-06,"d":"0"}},{"$f":"IF(P41=8,'JSM Jahresdauerlinie'!$E$26,IF(CI41=0,\" \",CI41))","v":{"v":1e-06,"d":"0"}},{"$f":"IF(R41=8,'JSM Jahresdauerlinie'!$E$26,IF(CK41=0,\" \",CK41))","v":{"v":1e-06,"d":"0"}},{"$f":"IF(T41=8,'JSM Jahresdauerlinie'!$E$26,IF(CM41=0,\" \",CM41))","v":{"v":1e-06,"d":"0"}},{"$f":"IF(V41=8,'JSM Jahresdauerlinie'!$E$26,IF(CO41=0,\" \",CO41))","v":{"v":1e-06,"d":"0"}},{"$f":"IF(X41=8,'JSM Jahresdauerlinie'!$E$26,IF(CQ41=0,\" \",CQ41))","v":{"v":1e-06,"d":"0"}},{"$f":"IF(Z41=8,'JSM Jahresdauerlinie'!$E$26,IF(CS41=0,\" \",CS41))","v":{"v":1e-06,"d":"0"}},null,{"v":1e-06,"d":"0"},{"v":1e-06,"d":"0"},{"v":1e-06,"d":"0"},{"v":1e-06,"d":"0"},{"v":1e-06,"d":"0"},{"v":1e-06,"d":"0"},{"v":1e-06,"d":"0"},{"v":1e-06,"d":"0"},{"v":1e-06,"d":"0"},{"v":1e-06,"d":"0"},{"v":1e-06,"d":"0"},{"v":1e-06,"d":"0"},null,null,8,8,8,8,8,8,8,8,8,8,8,8,null," "," "," "," "," "," "," "," "," "," "," "," "," "," "," "," "," "," "," "," "," "," "," "," "]
[null,11,{"$nulls":29}," "," "," "," "," "," "," "," "," "," "," "," ",{"$nulls":3},0,"",0,"",0,"",0,"",0,"",0,"",0,"",0,"",0,"",0,"",0,"",0,"",{"$nulls":3},8,{"$f":"IF(BV42=8,'JSM Jahresdauerlinie'!$E$26,E42)","v":{"v":1e-06,"d":"0"}},8,{"$f":"IF(BX42=8,'JSM Jahresdauerlinie'!$E$26,G42)","v":{"v":1e-06,"d":"0"}},8,{"$f":"IF(BZ42=8,'JSM Jahresdauerlinie'!$E$26,I42)","v":{"v":1e-06,"d":"0"}},8,{"$f":"IF(CB42=8,'JSM Jahresdauerlinie'!$E$26,K42)","v":{"v":1e-06,"d":"0"}},8,{"$f":"IF(CD42=8,'JSM Jahresdauerlinie'!$E$26,M42)","v":{"v":1e-06,"d":"0"}},8,{"$f":"IF(CF42=8,'JSM Jahresdauerlinie'!$E$26,O42)","v":{"v":1e-06,"d":"0"}},8,{"$f":"IF(CH42=8,'JSM Jahresdauerlinie'!$E$26,Q42)","v":{"v":1e-06,"d":"0"}},8,{"$f":"IF(CJ42=8,'JSM Jahresdauerlinie'!$E$26,S42)","v":{"v":1e-06,"d":"0"}},8,{"$f":"IF(CL42=8,'JSM Jahresdauerlinie'!$E$26,U42)","v":{"v":1e-06,"d":"0"}},8,{"$f":"IF(CN42=8,'JSM Jahresdauerlinie'!$E$26,W42)","v":{"v":1e-06,"d":"0"}},8,{"$f":"IF(CP42=8,'JSM Jahresdauerlinie'!$E$26,Y42)","v":{"v":1e-06,"d":"0"}},8,{"$f":"IF(CR42=8,'JSM Jahresdauerlinie'!$E$26,AA42)","v":{"v":1e-06,"d":"0"}},{"$nulls":3},{"$f":"IF(D42=8,'JSM Jahresdauerlinie'!$E$26,IF(BW42=0,\" \",BW42))","v":{"v":1e-06,"d":"0"}},{"$f":"IF(F42=8,'JSM Jahresdauerlinie'!$E$26,IF(BY42=0,\" \",BY42))","v":{"v":1e-06,"d":"0"}},{"$f":"IF(H42=8,'JSM Jahresdauerlinie'!$E$26,IF(CA42=0,\" \",CA42))","v":{"v":1e-06,"d":"0"}},{"$f":"IF(J42=8,'JSM Jahresdauerlinie'!$E$26,IF(CC42=0,\" \",CC42))","v":{"v":1e-06,"d":"0"}},{"$f":"IF(L42=8,'JSM Jahresdauerlinie'!$E$26,IF(CE42=0,\" \",CE42))","v":{"v":1e-06,"d":"0"}},{"$f":"IF(N42=8,'JSM Jahresdauerlinie'!$E$26,IF(CG42=0,\" \",CG42))","v":{"v":1e-06,"d":"0"}},{"$f":"IF(P42=8,'JSM Jahresdauerlinie'!$E$26,IF(CI42=0,\" \",CI42))","v":{"v":1e-06,"d":"0"}},{"$f":"IF(R42=8,'JSM Jahresdauerlinie'!$E$26,IF(CK42=0,\" \",CK42))","v":{"v":1e-06,"d":"0"}},{"$f":"IF(T42=8,'JSM Jahresdauerlinie'!$E$26,IF(CM42=0,\" \",CM42))","v":{"v":1e-06,"d":"0"}},{"$f":"IF(V42=8,'JSM Jahresdauerlinie'!$E$26,IF(CO42=0,\" \",CO42))","v":{"v":1e-06,"d":"0"}},{"$f":"IF(X42=8,'JSM Jahresdauerlinie'!$E$26,IF(CQ42=0,\" \",CQ42))","v":{"v":1e-06,"d":"0"}},{"$f":"IF(Z42=8,'JSM Jahresdauerlinie'!$E$26,IF(CS42=0,\" \",CS42))","v":{"v":1e-06,"d":"0"}},null,{"v":1e-06,"d":"0"},{"v":1e-06,"d":"0"},{"v":1e-06,"d":"0"},{"v":1e-06,"d":"0"},{"v":1e-06,"d":"0"},{"v":1e-06,"d":"0"},{"v":1e-06,"d":"0"},{"v":1e-06,"d":"0"},{"v":1e-06,"d":"0"},{"v":1e-06,"d":"0"},{"v":1e-06,"d":"0"},{"v":1e-06,"d":"0"},null,null,8,8,8,8,8,8,8,8,8,8,8,8,null," "," "," "," "," "," "," "," "," "," "," "," "," "," "," "," "," "," "," "," "," "," "," "," "]
[null,12,{"$nulls":29}," "," "," "," "," "," "," "," "," "," "," "," ",{"$nulls":3},0,"",0,"",{"$f":"H43","v":0},"",{"$f":"J43","v":0},"",{"$f":"L43","v":0},"",{"$f":"N43","v":0},"",{"$f":"P43","v":0},"",{"$f":"R43","v":0},"",{"$f":"T43","v":0},"",{"$f":"V43","v":0},"",{"$f":"X43","v":0},"",{"$f":"Z43","v":0},"",{"$nulls":3},8,{"$f":"IF(BV43=8,'JSM Jahresdauerlinie'!$E$26,E43)","v":{"v":1e-06,"d":"0"}},8,{"$f":"IF(BX43=8,'JSM Jahresdauerlinie'!$E$26,G43)","v":{"v":1e-06,"d":"0"}},8,{"$f":"IF(BZ43=8,'JSM Jahresdauerlinie'!$E$26,I43)","v":{"v":1e-06,"d":"0"}},8,{"$f":"IF(CB43=8,'JSM Jahresdauerlinie'!$E$26,K43)","v":{"v":1e-06,"d":"0"}},8,{"$f":"IF(CD43=8,'JSM Jahresdauerlinie'!$E$26,M43)","v":{"v":1e-06,"d":"0"}},8,{"$f":"IF(CF43=8,'JSM Jahresdauerlinie'!$E$26,O43)","v":{"v":1e-06,"d":"0"}},8,{"$f":"IF(CH43=8,'JSM Jahresdauerlinie'!$E$26,Q43)","v":{"v":1e-06,"d":"0"}},8,{"$f":"IF(CJ43=8,'JSM Jahresdauerlinie'!$E$26,S43)","v":{"v":1e-06,"d":"0"}},8,{"$f":"IF(CL43=8,'JSM Jahresdauerlinie'!$E$26,U43)","v":{"v":1e-06,"d":"0"}},8,{"$f":"IF(CN43=8,'JSM Jahresdauerlinie'!$E$26,W43)","v":{"v":1e-06,"d":"0"}},8,{"$f":"IF(CP43=8,'JSM Jahresdauerlinie'!$E$26,Y43)","v":{"v":1e-06,"d":"0"}},8,{"$f":"IF(CR43=8,'JSM Jahresdauerlinie'!$E$26,AA43)","v":{"v":1e-06,"d":"0"}},{"$nulls":3},{"$f":"IF(D43=8,'JSM Jahresdauerlinie'!$E$26,IF(BW43=0,\" \",BW43))","v":{"v":1e-06,"d":"0"}},{"$f":"IF(F43=8,'JSM Jahresdauerlinie'!$E$26,IF(BY43=0,\" \",BY43))","v":{"v":1e-06,"d":"0"}},{"$f":"IF(H43=8,'JSM Jahresdauerlinie'!$E$26,IF(CA43=0,\" \",CA43))","v":{"v":1e-06,"d":"0"}},{"$f":"IF(J43=8,'JSM Jahresdauerlinie'!$E$26,IF(CC43=0,\" \",CC43))","v":{"v":1e-06,"d":"0"}},{"$f":"IF(L43=8,'JSM Jahresdauerlinie'!$E$26,IF(CE43=0,\" \",CE43))","v":{"v":1e-06,"d":"0"}},{"$f":"IF(N43=8,'JSM Jahresdauerlinie'!$E$26,IF(CG43=0,\" \",CG43))","v":{"v":1e-06,"d":"0"}},{"$f":"IF(P43=8,'JSM Jahresdauerlinie'!$E$26,IF(CI43=0,\" \",CI43))","v":{"v":1e-06,"d":"0"}},{"$f":"IF(R43=8,'JSM Jahresdauerlinie'!$E$26,IF(CK43=0,\" \",CK43))","v":{"v":1e-06,"d":"0"}},{"$f":"IF(T43=8,'JSM Jahresdauerlinie'!$E$26,IF(CM43=0,\" \",CM43))","v":{"v":1e-06,"d":"0"}},{"$f":"IF(V43=8,'JSM Jahresdauerlinie'!$E$26,IF(CO43=0,\" \",CO43))","v":{"v":1e-06,"d":"0"}},{"$f":"IF(X43=8,'JSM Jahresdauerlinie'!$E$26,IF(CQ43=0,\" \",CQ43))","v":{"v":1e-06,"d":"0"}},{"$f":"IF(Z43=8,'JSM Jahresdauerlinie'!$E$26,IF(CS43=0,\" \",CS43))","v":{"v":1e-06,"d":"0"}},null,{"v":1e-06,"d":"0"},{"v":1e-06,"d":"0"},{"v":1e-06,"d":"0"},{"v":1e-06,"d":"0"},{"v":1e-06,"d":"0"},{"v":1e-06,"d":"0"},{"v":1e-06,"d":"0"},{"v":1e-06,"d":"0"},{"v":1e-06,"d":"0"},{"v":1e-06,"d":"0"},{"v":1e-06,"d":"0"},{"v":1e-06,"d":"0"},null,null,8,8,8,8,8,8,8,8,8,8,8,8,null," "," "," "," "," "," "," "," "," "," "," "," "," "," "," "," "," "," "," "," "," "," "," "," "]
[null,13,{"$nulls":29}," "," "," "," "," "," "," "," "," "," "," "," ",{"$nulls":3},0,"",{"$f":"F44","v":0},"",0,"",0,"",0,"",0,"",0,"",0,"",0,"",0,"",0,"",0,"",{"$nulls":3},8,{"$f":"IF(BV44=8,'JSM Jahresdauerlinie'!$E$26,E44)","v":{"v":1e-06,"d":"0"}},8,{"$f":"IF(BX44=8,'JSM Jahresdauerlinie'!$E$26,G44)","v":{"v":1e-06,"d":"0"}},8,{"$f":"IF(BZ44=8,'JSM Jahresdauerlinie'!$E$26,I44)","v":{"v":1e-06,"d":"0"}},8,{"$f":"IF(CB44=8,'JSM Jahresdauerlinie'!$E$26,K44)","v":{"v":1e-06,"d":"0"}},8,{"$f":"IF(CD44=8,'JSM Jahresdauerlinie'!$E$26,M44)","v":{"v":1e-06,"d":"0"}},8,{"$f":"IF(CF44=8,'JSM Jahresdauerlinie'!$E$26,O44)","v":{"v":1e-06,"d":"0"}},8,{"$f":"IF(CH44=8,'JSM Jahresdauerlinie'!$E$26,Q44)","v":{"v":1e-06,"d":"0"}},8,{"$f":"IF(CJ44=8,'JSM Jahresdauerlinie'!$E$26,S44)","v":{"v":1e-06,"d":"0"}},8,{"$f":"IF(CL44=8,'JSM Jahresdauerlinie'!$E$26,U44)","v":{"v":1e-06,"d":"0"}},8,{"$f":"IF(CN44=8,'JSM Jahresdauerlinie'!$E$26,W44)","v":{"v":1e-06,"d":"0"}},8,{"$f":"IF(CP44=8,'JSM Jahresdauerlinie'!$E$26,Y44)","v":{"v":1e-06,"d":"0"}},8,{"$f":"IF(CR44=8,'JSM Jahresdauerlinie'!$E$26,AA44)","v":{"v":1e-06,"d":"0"}},{"$nulls":3},{"$f":"IF(D44=8,'JSM Jahresdauerlinie'!$E$26,IF(BW44=0,\" \",BW44))","v":{"v":1e-06,"d":"0"}},{"$f":"IF(F44=8,'JSM Jahresdauerlinie'!$E$26,IF(BY44=0,\" \",BY44))","v":{"v":1e-06,"d":"0"}},{"$f":"IF(H44=8,'JSM Jahresdauerlinie'!$E$26,IF(CA44=0,\" \",CA44))","v":{"v":1e-06,"d":"0"}},{"$f":"IF(J44=8,'JSM Jahresdauerlinie'!$E$26,IF(CC44=0,\" \",CC44))","v":{"v":1e-06,"d":"0"}},{"$f":"IF(L44=8,'JSM Jahresdauerlinie'!$E$26,IF(CE44=0,\" \",CE44))","v":{"v":1e-06,"d":"0"}},{"$f":"IF(N44=8,'JSM Jahresdauerlinie'!$E$26,IF(CG44=0,\" \",CG44))","v":{"v":1e-06,"d":"0"}},{"$f":"IF(P44=8,'JSM Jahresdauerlinie'!$E$26,IF(CI44=0,\" \",CI44))","v":{"v":1e-06,"d":"0"}},{"$f":"IF(R44=8,'JSM Jahresdauerlinie'!$E$26,IF(CK44=0,\" \",CK44))","v":{"v":1e-06,"d":"0"}},{"$f":"IF(T44=8,'JSM Jahresdauerlinie'!$E$26,IF(CM44=0,\" \",CM44))","v":{"v":1e-06,"d":"0"}},{"$f":"IF(V44=8,'JSM Jahresdauerlinie'!$E$26,IF(CO44=0,\" \",CO44))","v":{"v":1e-06,"d":"0"}},{"$f":"IF(X44=8,'JSM Jahresdauerlinie'!$E$26,IF(CQ44=0,\" \",CQ44))","v":{"v":1e-06,"d":"0"}},{"$f":"IF(Z44=8,'JSM Jahresdauerlinie'!$E$26,IF(CS44=0,\" \",CS44))","v":{"v":1e-06,"d":"0"}},null,{"v":1e-06,"d":"0"},{"v":1e-06,"d":"0"},{"v":1e-06,"d":"0"},{"v":1e-06,"d":"0"},{"v":1e-06,"d":"0"},{"v":1e-06,"d":"0"},{"v":1e-06,"d":"0"},{"v":1e-06,"d":"0"},{"v":1e-06,"d":"0"},{"v":1e-06,"d":"0"},{"v":1e-06,"d":"0"},{"v":1e-06,"d":"0"},null,null,8,8,8,8,8,8,8,8,8,8,8,8,null," "," "," "," "," "," "," "," "," "," "," "," "," "," "," "," "," "," "," "," "," "," "," "," "]
[null,14,{"$nulls":29}," "," "," "," "," "," "," "," "," "," "," "," ",{"$nulls":3},0,"",0,"",0,"",0,"",0,"",0,"",0,"",0,"",0,"",0,"",0,"",0,"",{"$nulls":3},8,{"$f":"IF(BV45=8,'JSM Jahresdauerlinie'!$E$26,E45)","v":{"v":1e-06,"d":"0"}},8,{"$f":"IF(BX45=8,'JSM Jahresdauerlinie'!$E$26,G45)","v":{"v":1e-06,"d":"0"}},8,{"$f":"IF(BZ45=8,'JSM Jahresdauerlinie'!$E$26,I45)","v":{"v":1e-06,"d":"0"}},8,{"$f":"IF(CB45=8,'JSM Jahresdauerlinie'!$E$26,K45)","v":{"v":1e-06,"d":"0"}},8,{"$f":"IF(CD45=8,'JSM Jahresdauerlinie'!$E$26,M45)","v":{"v":1e-06,"d":"0"}},8,{"$f":"IF(CF45=8,'JSM Jahresdauerlinie'!$E$26,O45)","v":{"v":1e-06,"d":"0"}},8,{"$f":"IF(CH45=8,'JSM Jahresdauerlinie'!$E$26,Q45)","v":{"v":1e-06,"d":"0"}},8,{"$f":"IF(CJ45=8,'JSM Jahresdauerlinie'!$E$26,S45)","v":{"v":1e-06,"d":"0"}},8,{"$f":"IF(CL45=8,'JSM Jahresdauerlinie'!$E$26,U45)","v":{"v":1e-06,"d":"0"}},8,{"$f":"IF(CN45=8,'JSM Jahresdauerlinie'!$E$26,W45)","v":{"v":1e-06,"d":"0"}},8,{"$f":"IF(CP45=8,'JSM Jahresdauerlinie'!$E$26,Y45)","v":{"v":1e-06,"d":"0"}},8,{"$f":"IF(CR45=8,'JSM Jahresdauerlinie'!$E$26,AA45)","v":{"v":1e-06,"d":"0"}},{"$nulls":3},{"$f":"IF(D45=8,'JSM Jahresdauerlinie'!$E$26,IF(BW45=0,\" \",BW45))","v":{"v":1e-06,"d":"0"}},{"$f":"IF(F45=8,'JSM Jahresdauerlinie'!$E$26,IF(BY45=0,\" \",BY45))","v":{"v":1e-06,"d":"0"}},{"$f":"IF(H45=8,'JSM Jahresdauerlinie'!$E$26,IF(CA45=0,\" \",CA45))","v":{"v":1e-06,"d":"0"}},{"$f":"IF(J45=8,'JSM Jahresdauerlinie'!$E$26,IF(CC45=0,\" \",CC45))","v":{"v":1e-06,"d":"0"}},{"$f":"IF(L45=8,'JSM Jahresdauerlinie'!$E$26,IF(CE45=0,\" \",CE45))","v":{"v":1e-06,"d":"0"}},{"$f":"IF(N45=8,'JSM Jahresdauerlinie'!$E$26,IF(CG45=0,\" \",CG45))","v":{"v":1e-06,"d":"0"}},{"$f":"IF(P45=8,'JSM Jahresdauerlinie'!$E$26,IF(CI45=0,\" \",CI45))","v":{"v":1e-06,"d":"0"}},{"$f":"IF(R45=8,'JSM Jahresdauerlinie'!$E$26,IF(CK45=0,\" \",CK45))","v":{"v":1e-06,"d":"0"}},{"$f":"IF(T45=8,'JSM Jahresdauerlinie'!$E$26,IF(CM45=0,\" \",CM45))","v":{"v":1e-06,"d":"0"}},{"$f":"IF(V45=8,'JSM Jahresdauerlinie'!$E$26,IF(CO45=0,\" \",CO45))","v":{"v":1e-06,"d":"0"}},{"$f":"IF(X45=8,'JSM Jahresdauerlinie'!$E$26,IF(CQ45=0,\" \",CQ45))","v":{"v":1e-06,"d":"0"}},{"$f":"IF(Z45=8,'JSM Jahresdauerlinie'!$E$26,IF(CS45=0,\" \",CS45))","v":{"v":1e-06,"d":"0"}},null,{"v":1e-06,"d":"0"},{"v":1e-06,"d":"0"},{"v":1e-06,"d":"0"},{"v":1e-06,"d":"0"},{"v":1e-06,"d":"0"},{"v":1e-06,"d":"0"},{"v":1e-06,"d":"0"},{"v":1e-06,"d":"0"},{"v":1e-06,"d":"0"},{"v":1e-06,"d":"0"},{"v":1e-06,"d":"0"},{"v":1e-06,"d":"0"},null,null,8,8,8,8,8,8,8,8,8,8,8,8,null," "," "," "," "," "," "," "," "," "," "," "," "," "," "," "," "," "," "," "," "," "," "," "," "]
[null,15,{"$nulls":29}," "," "," "," "," "," "," "," "," "," "," "," ",{"$nulls":3},0,"",0,"",0,"",0,"",0,"",0,"",0,"",0,"",0,"",0,"",0,"",0,"",{"$nulls":3},8,{"$f":"IF(BV46=8,'JSM Jahresdauerlinie'!$E$26,E46)","v":{"v":1e-06,"d":"0"}},8,{"$f":"IF(BX46=8,'JSM Jahresdauerlinie'!$E$26,G46)","v":{"v":1e-06,"d":"0"}},8,{"$f":"IF(BZ46=8,'JSM Jahresdauerlinie'!$E$26,I46)","v":{"v":1e-06,"d":"0"}},8,{"$f":"IF(CB46=8,'JSM Jahresdauerlinie'!$E$26,K46)","v":{"v":1e-06,"d":"0"}},8,{"$f":"IF(CD46=8,'JSM Jahresdauerlinie'!$E$26,M46)","v":{"v":1e-06,"d":"0"}},8,{"$f":"IF(CF46=8,'JSM Jahresdauerlinie'!$E$26,O46)","v":{"v":1e-06,"d":"0"}},8,{"$f":"IF(CH46=8,'JSM Jahresdauerlinie'!$E$26,Q46)","v":{"v":1e-06,"d":"0"}},8,{"$f":"IF(CJ46=8,'JSM Jahresdauerlinie'!$E$26,S46)","v":{"v":1e-06,"d":"0"}},8,{"$f":"IF(CL46=8,'JSM Jahresdauerlinie'!$E$26,U46)","v":{"v":1e-06,"d":"0"}},8,{"$f":"IF(CN46=8,'JSM Jahresdauerlinie'!$E$26,W46)","v":{"v":1e-06,"d":"0"}},8,{"$f":"IF(CP46=8,'JSM Jahresdauerlinie'!$E$26,Y46)","v":{"v":1e-06,"d":"0"}},8,{"$f":"IF(CR46=8,'JSM Jahresdauerlinie'!$E$26,AA46)","v":{"v":1e-06,"d":"0"}},{"$nulls":3},{"$f":"IF(D46=8,'JSM Jahresdauerlinie'!$E$26,IF(BW46=0,\" \",BW46))","v":{"v":1e-06,"d":"0"}},{"$f":"IF(F46=8,'JSM Jahresdauerlinie'!$E$26,IF(BY46=0,\" \",BY46))","v":{"v":1e-06,"d":"0"}},{"$f":"IF(H46=8,'JSM Jahresdauerlinie'!$E$26,IF(CA46=0,\" \",CA46))","v":{"v":1e-06,"d":"0"}},{"$f":"IF(J46=8,'JSM Jahresdauerlinie'!$E$26,IF(CC46=0,\" \",CC46))","v":{"v":1e-06,"d":"0"}},{"$f":"IF(L46=8,'JSM Jahresdauerlinie'!$E$26,IF(CE46=0,\" \",CE46))","v":{"v":1e-06,"d":"0"}},{"$f":"IF(N46=8,'JSM Jahresdauerlinie'!$E$26,IF(CG46=0,\" \",CG46))","v":{"v":1e-06,"d":"0"}},{"$f":"IF(P46=8,'JSM Jahresdauerlinie'!$E$26,IF(CI46=0,\" \",CI46))","v":{"v":1e-06,"d":"0"}},{"$f":"IF(R46=8,'JSM Jahresdauerlinie'!$E$26,IF(CK46=0,\" \",CK46))","v":{"v":1e-06,"d":"0"}},{"$f":"IF(T46=8,'JSM Jahresdauerlinie'!$E$26,IF(CM46=0,\" \",CM46))","v":{"v":1e-06,"d":"0"}},{"$f":"IF(V46=8,'JSM Jahresdauerlinie'!$E$26,IF(CO46=0,\" \",CO46))","v":{"v":1e-06,"d":"0"}},{"$f":"IF(X46=8,'JSM Jahresdauerlinie'!$E$26,IF(CQ46=0,\" \",CQ46))","v":{"v":1e-06,"d":"0"}},{"$f":"IF(Z46=8,'JSM Jahresdauerlinie'!$E$26,IF(CS46=0,\" \",CS46))","v":{"v":1e-06,"d":"0"}},null,{"v":1e-06,"d":"0"},{"v":1e-06,"d":"0"},{"v":1e-06,"d":"0"},{"v":1e-06,"d":"0"},{"v":1e-06,"d":"0"},{"v":1e-06,"d":"0"},{"v":1e-06,"d":"0"},{"v":1e-06,"d":"0"},{"v":1e-06,"d":"0"},{"v":1e-06,"d":"0"},{"v":1e-06,"d":"0"},{"v":1e-06,"d":"0"},null,null,8,8,8,8,8,8,8,8,8,8,8,8,null," "," "," "," "," "," "," "," "," "," "," "," "," "," "," "," "," "," "," "," "," "," "," "," "]
[null,16,{"$nulls":29}," "," "," "," "," "," "," "," "," "," "," "," ",{"$nulls":3},0,"",0,"",0,"",0,"",0,"",0,"",0,"",0,"",0,"",0,"",0,"",0,"",{"$nulls":3},8,{"$f":"IF(BV47=8,'JSM Jahresdauerlinie'!$E$26,E47)","v":{"v":1e-06,"d":"0"}},8,{"$f":"IF(BX47=8,'JSM Jahresdauerlinie'!$E$26,G47)","v":{"v":1e-06,"d":"0"}},8,{"$f":"IF(BZ47=8,'JSM Jahresdauerlinie'!$E$26,I47)","v":{"v":1e-06,"d":"0"}},8,{"$f":"IF(CB47=8,'JSM Jahresdauerlinie'!$E$26,K47)","v":{"v":1e-06,"d":"0"}},8,{"$f":"IF(CD47=8,'JSM Jahresdauerlinie'!$E$26,M47)","v":{"v":1e-06,"d":"0"}},8,{"$f":"IF(CF47=8,'JSM Jahresdauerlinie'!$E$26,O47)","v":{"v":1e-06,"d":"0"}},8,{"$f":"IF(CH47=8,'JSM Jahresdauerlinie'!$E$26,Q47)","v":{"v":1e-06,"d":"0"}},8,{"$f":"IF(CJ47=8,'JSM Jahresdauerlinie'!$E$26,S47)","v":{"v":1e-06,"d":"0"}},8,{"$f":"IF(CL47=8,'JSM Jahresdauerlinie'!$E$26,U47)","v":{"v":1e-06,"d":"0"}},8,{"$f":"IF(CN47=8,'JSM Jahresdauerlinie'!$E$26,W47)","v":{"v":1e-06,"d":"0"}},8,{"$f":"IF(CP47=8,'JSM Jahresdauerlinie'!$E$26,Y47)","v":{"v":1e-06,"d":"0"}},8,{"$f":"IF(CR47=8,'JSM Jahresdauerlinie'!$E$26,AA47)","v":{"v":1e-06,"d":"0"}},{"$nulls":3},{"$f":"IF(D47=8,'JSM Jahresdauerlinie'!$E$26,IF(BW47=0,\" \",BW47))","v":{"v":1e-06,"d":"0"}},{"$f":"IF(F47=8,'JSM Jahresdauerlinie'!$E$26,IF(BY47=0,\" \",BY47))","v":{"v":1e-06,"d":"0"}},{"$f":"IF(H47=8,'JSM Jahresdauerlinie'!$E$26,IF(CA47=0,\" \",CA47))","v":{"v":1e-06,"d":"0"}},{"$f":"IF(J47=8,'JSM Jahresdauerlinie'!$E$26,IF(CC47=0,\" \",CC47))","v":{"v":1e-06,"d":"0"}},{"$f":"IF(L47=8,'JSM Jahresdauerlinie'!$E$26,IF(CE47=0,\" \",CE47))","v":{"v":1e-06,"d":"0"}},{"$f":"IF(N47=8,'JSM Jahresdauerlinie'!$E$26,IF(CG47=0,\" \",CG47))","v":{"v":1e-06,"d":"0"}},{"$f":"IF(P47=8,'JSM Jahresdauerlinie'!$E$26,IF(CI47=0,\" \",CI47))","v":{"v":1e-06,"d":"0"}},{"$f":"IF(R47=8,'JSM Jahresdauerlinie'!$E$26,IF(CK47=0,\" \",CK47))","v":{"v":1e-06,"d":"0"}},{"$f":"IF(T47=8,'JSM Jahresdauerlinie'!$E$26,IF(CM47=0,\" \",CM47))","v":{"v":1e-06,"d":"0"}},{"$f":"IF(V47=8,'JSM Jahresdauerlinie'!$E$26,IF(CO47=0,\" \",CO47))","v":{"v":1e-06,"d":"0"}},{"$f":"IF(X47=8,'JSM Jahresdauerlinie'!$E$26,IF(CQ47=0,\" \",CQ47))","v":{"v":1e-06,"d":"0"}},{"$f":"IF(Z47=8,'JSM Jahresdauerlinie'!$E$26,IF(CS47=0,\" \",CS47))","v":{"v":1e-06,"d":"0"}},null,{"v":1e-06,"d":"0"},{"v":1e-06,"d":"0"},{"v":1e-06,"d":"0"},{"v":1e-06,"d":"0"},{"v":1e-06,"d":"0"},{"v":1e-06,"d":"0"},{"v":1e-06,"d":"0"},{"v":1e-06,"d":"0"},{"v":1e-06,"d":"0"},{"v":1e-06,"d":"0"},{"v":1e-06,"d":"0"},{"v":1e-06,"d":"0"},null,null,8,8,8,8,8,8,8,8,8,8,8,8,null," "," "," "," "," "," "," "," "," "," "," "," "," "," "," "," "," "," "," "," "," "," "," "," "]
[null,17,{"$nulls":29}," ",{"$f":"IF(G48=0,\" \",IF(G48>0,G48,\" \"))","v":" "},{"$f":"IF(I48=0,\" \",IF(I48>0,I48,\" \"))","v":" "},{"$f":"IF(K48=0,\" \",IF(K48>0,K48,\" \"))","v":" "},{"$f":"IF(M48=0,\" \",IF(M48>0,M48,\" \"))","v":" "},{"$f":"IF(O48=0,\" \",IF(O48>0,O48,\" \"))","v":" "},{"$f":"IF(Q48=0,\" \",IF(Q48>0,Q48,\" \"))","v":" "},{"$f":"IF(S48=0,\" \",IF(S48>0,S48,\" \"))","v":" "}," "," "," "," ",{"$nulls":3},0,"",0,"",0,"",0,"",0,"",0,"",0,"",0,"",0,{"$f":"IF(BK48=8,\"\",IF(U48=\"\",\"\",U48))","v":""},0,"",0,"",0,"",{"$nulls":3},8,{"$f":"IF(BV48=8,'JSM Jahresdauerlinie'!$E$26,E48)","v":{"v":1e-06,"d":"0"}},8,{"$f":"IF(BX48=8,'JSM Jahresdauerlinie'!$E$26,G48)","v":{"v":1e-06,"d":"0"}},8,{"$f":"IF(BZ48=8,'JSM Jahresdauerlinie'!$E$26,I48)","v":{"v":1e-06,"d":"0"}},8,{"$f":"IF(CB48=8,'JSM Jahresdauerlinie'!$E$26,K48)","v":{"v":1e-06,"d":"0"}},8,{"$f":"IF(CD48=8,'JSM Jahresdauerlinie'!$E$26,M48)","v":{"v":1e-06,"d":"0"}},8,{"$f":"IF(CF48=8,'JSM Jahresdauerlinie'!$E$26,O48)","v":{"v":1e-06,"d":"0"}},8,{"$f":"IF(CH48=8,'JSM Jahresdauerlinie'!$E$26,Q48)","v":{"v":1e-06,"d":"0"}},8,{"$f":"IF(CJ48=8,'JSM Jahresdauerlinie'!$E$26,S48)","v":{"v":1e-06,"d":"0"}},8,{"$f":"IF(CL48=8,'JSM Jahresdauerlinie'!$E$26,U48)","v":{"v":1e-06,"d":"0"}},8,{"$f":"IF(CN48=8,'JSM Jahresdauerlinie'!$E$26,W48)","v":{"v":1e-06,"d":"0"}},8,{"$f":"IF(CP48=8,'JSM Jahresdauerlinie'!$E$26,Y48)","v":{"v":1e-06,"d":"0"}},8,{"$f":"IF(CR48=8,'JSM Jahresdauerlinie'!$E$26,AA48)","v":{"v":1e-06,"d":"0"}},{"$nulls":3},{"$f":"IF(D48=8,'JSM Jahresdauerlinie'!$E$26,IF(BW48=0,\" \",BW48))","v":{"v":1e-06,"d":"0"}},{"$f":"IF(F48=8,'JSM Jahresdauerlinie'!$E$26,IF(BY48=0,\" \",BY48))","v":{"v":1e-06,"d":"0"}},{"$f":"IF(H48=8,'JSM Jahresdauerlinie'!$E$26,IF(CA48=0,\" \",CA48))","v":{"v":1e-06,"d":"0"}},{"$f":"IF(J48=8,'JSM Jahresdauerlinie'!$E$26,IF(CC48=0,\" \",CC48))","v":{"v":1e-06,"d":"0"}},{"$f":"IF(L48=8,'JSM Jahresdauerlinie'!$E$26,IF(CE48=0,\" \",CE48))","v":{"v":1e-06,"d":"0"}},{"$f":"IF(N48=8,'JSM Jahresdauerlinie'!$E$26,IF(CG48=0,\" \",CG48))","v":{"v":1e-06,"d":"0"}},{"$f":"IF(P48=8,'JSM Jahresdauerlinie'!$E$26,IF(CI48=0,\" \",CI48))","v":{"v":1e-06,"d":"0"}},{"$f":"IF(R48=8,'JSM Jahresdauerlinie'!$E$26,IF(CK48=0,\" \",CK48))","v":{"v":1e-06,"d":"0"}},{"$f":"IF(T48=8,'JSM Jahresdauerlinie'!$E$26,IF(CM48=0,\" \",CM48))","v":{"v":1e-06,"d":"0"}},{"$f":"IF(V48=8,'JSM Jahresdauerlinie'!$E$26,IF(CO48=0,\" \",CO48))","v":{"v":1e-06,"d":"0"}},{"$f":"IF(X48=8,'JSM Jahresdauerlinie'!$E$26,IF(CQ48=0,\" \",CQ48))","v":{"v":1e-06,"d":"0"}},{"$f":"IF(Z48=8,'JSM Jahresdauerlinie'!$E$26,IF(CS48=0,\" \",CS48))","v":{"v":1e-06,"d":"0"}},null,{"v":1e-06,"d":"0"},{"$f":"IF(CX48=\" \",$CU$92+0.01,CX48)","v":{"v":1e-06,"d":"0"}},{"$f":"IF(CY48=\" \",$CU$92+0.01,CY48)","v":{"v":1e-06,"d":"0"}},{"$f":"IF(CZ48=\" \",$CU$92+0.01,CZ48)","v":{"v":1e-06,"d":"0"}},{"$f":"IF(DA48=\" \",$CU$92+0.01,DA48)","v":{"v":1e-06,"d":"0"}},{"$f":"IF(DB48=\" \",$CU$92+0.01,DB48)","v":{"v":1e-06,"d":"0"}},{"$f":"IF(DC48=\" \",$CU$92+0.01,DC48)","v":{"v":1e-06,"d":"0"}},{"$f":"IF(DD48=\" \",$CU$92+0.01,DD48)","v":{"v":1e-06,"d":"0"}},{"$f":"IF(DE48=\" \",$CU$92+0.01,DE48)","v":{"v":1e-06,"d":"0"}},{"$f":"IF(DF48=\" \",$CU$92+0.01,DF48)","v":{"v":1e-06,"d":"0"}},{"$f":"IF(DG48=\" \",$CU$92+0.01,DG48)","v":{"v":1e-06,"d":"0"}},{"$f":"IF(DH48=\" \",$CU$92+0.01,DH48)","v":{"v":1e-06,"d":"0"}},null,null,8,8,8,8,8,8,8,8,8,8,8,8,null," "," "," "," "," "," "," "," "," "," "," "," "," "," "," "," ",{"$f":"IF(T48=0,\" \",T48)","v":" "},{"$f":"IF(U48=0,\" \",IF(FA48=\" \",\" \",IF(T48<=2,U48,\" \")))","v":" "}," "," "," "," "," "," "]
[null,18,{"$nulls":29}," "," "," "," "," "," "," "," "," "," "," "," ",{"$nulls":3},0,"",0,"",0,"",0,"",0,"",0,"",0,"",0,"",0,"",0,"",0,"",0,"",{"$nulls":3},8,{"$f":"IF(BV49=8,'JSM Jahresdauerlinie'!$E$26,E49)","v":{"v":1e-06,"d":"0"}},8,{"$f":"IF(BX49=8,'JSM Jahresdauerlinie'!$E$26,G49)","v":{"v":1e-06,"d":"0"}},8,{"$f":"IF(BZ49=8,'JSM Jahresdauerlinie'!$E$26,I49)","v":{"v":1e-06,"d":"0"}},8,{"$f":"IF(CB49=8,'JSM Jahresdauerlinie'!$E$26,K49)","v":{"v":1e-06,"d":"0"}},8,{"$f":"IF(CD49=8,'JSM Jahresdauerlinie'!$E$26,M49)","v":{"v":1e-06,"d":"0"}},8,{"$f":"IF(CF49=8,'JSM Jahresdauerlinie'!$E$26,O49)","v":{"v":1e-06,"d":"0"}},8,{"$f":"IF(CH49=8,'JSM Jahresdauerlinie'!$E$26,Q49)","v":{"v":1e-06,"d":"0"}},8,{"$f":"IF(CJ49=8,'JSM Jahresdauerlinie'!$E$26,S49)","v":{"v":1e-06,"d":"0"}},8,{"$f":"IF(CL49=8,'JSM Jahresdauerlinie'!$E$26,U49)","v":{"v":1e-06,"d":"0"}},8,{"$f":"IF(CN49=8,'JSM Jahresdauerlinie'!$E$26,W49)","v":{"v":1e-06,"d":"0"}},8,{"$f":"IF(CP49=8,'JSM Jahresdauerlinie'!$E$26,Y49)","v":{"v":1e-06,"d":"0"}},8,{"$f":"IF(CR49=8,'JSM Jahresdauerlinie'!$E$26,AA49)","v":{"v":1e-06,"d":"0"}},{"$nulls":3},{"$f":"IF(D49=8,'JSM Jahresdauerlinie'!$E$26,IF(BW49=0,\" \",BW49))","v":{"v":1e-06,"d":"0"}},{"$f":"IF(F49=8,'JSM Jahresdauerlinie'!$E$26,IF(BY49=0,\" \",BY49))","v":{"v":1e-06,"d":"0"}},{"$f":"IF(H49=8,'JSM Jahresdauerlinie'!$E$26,IF(CA49=0,\" \",CA49))","v":{"v":1e-06,"d":"0"}},{"$f":"IF(J49=8,'JSM Jahresdauerlinie'!$E$26,IF(CC49=0,\" \",CC49))","v":{"v":1e-06,"d":"0"}},{"$f":"IF(L49=8,'JSM Jahresdauerlinie'!$E$26,IF(CE49=0,\" \",CE49))","v":{"v":1e-06,"d":"0"}},{"$f":"IF(N49=8,'JSM Jahresdauerlinie'!$E$26,IF(CG49=0,\" \",CG49))","v":{"v":1e-06,"d":"0"}},{"$f":"IF(P49=8,'JSM Jahresdauerlinie'!$E$26,IF(CI49=0,\" \",CI49))","v":{"v":1e-06,"d":"0"}},{"$f":"IF(R49=8,'JSM Jahresdauerlinie'!$E$26,IF(CK49=0,\" \",CK49))","v":{"v":1e-06,"d":"0"}},{"$f":"IF(T49=8,'JSM Jahresdauerlinie'!$E$26,IF(CM49=0,\" \",CM49))","v":{"v":1e-06,"d":"0"}},{"$f":"IF(V49=8,'JSM Jahresdauerlinie'!$E$26,IF(CO49=0,\" \",CO49))","v":{"v":1e-06,"d":"0"}},{"$f":"IF(X49=8,'JSM Jahresdauerlinie'!$E$26,IF(CQ49=0,\" \",CQ49))","v":{"v":1e-06,"d":"0"}},{"$f":"IF(Z49=8,'JSM Jahresdauerlinie'!$E$26,IF(CS49=0,\" \",CS49))","v":{"v":1e-06,"d":"0"}},null,{"v":1e-06,"d":"0"},{"v":1e-06,"d":"0"},{"v":1e-06,"d":"0"},{"v":1e-06,"d":"0"},{"v":1e-06,"d":"0"},{"v":1e-06,"d":"0"},{"v":1e-06,"d":"0"},{"v":1e-06,"d":"0"},{"v":1e-06,"d":"0"},{"v":1e-06,"d":"0"},{"v":1e-06,"d":"0"},{"v":1e-06,"d":"0"},null,null,8,8,8,8,8,8,8,8,8,8,8,8,null," "," "," "," "," "," "," "," "," "," "," "," "," "," "," "," "," "," "," "," "," "," "," "," "]
[null,19,{"$nulls":29}," "," "," "," "," "," "," "," "," "," "," "," ",{"$nulls":3},0,"",0,"",0,"",0,"",0,"",0,"",0,"",0,"",0,"",0,"",0,"",0,"",{"$nulls":3},8,{"$f":"IF(BV50=8,'JSM Jahresdauerlinie'!$E$26,E50)","v":{"v":1e-06,"d":"0"}},8,{"$f":"IF(BX50=8,'JSM Jahresdauerlinie'!$E$26,G50)","v":{"v":1e-06,"d":"0"}},8,{"$f":"IF(BZ50=8,'JSM Jahresdauerlinie'!$E$26,I50)","v":{"v":1e-06,"d":"0"}},8,{"$f":"IF(CB50=8,'JSM Jahresdauerlinie'!$E$26,K50)","v":{"v":1e-06,"d":"0"}},8,{"$f":"IF(CD50=8,'JSM Jahresdauerlinie'!$E$26,M50)","v":{"v":1e-06,"d":"0"}},8,{"$f":"IF(CF50=8,'JSM Jahresdauerlinie'!$E$26,O50)","v":{"v":1e-06,"d":"0"}},8,{"$f":"IF(CH50=8,'JSM Jahresdauerlinie'!$E$26,Q50)","v":{"v":1e-06,"d":"0"}},8,{"$f":"IF(CJ50=8,'JSM Jahresdauerlinie'!$E$26,S50)","v":{"v":1e-06,"d":"0"}},8,{"$f":"IF(CL50=8,'JSM Jahresdauerlinie'!$E$26,U50)","v":{"v":1e-06,"d":"0"}},8,{"$f":"IF(CN50=8,'JSM Jahresdauerlinie'!$E$26,W50)","v":{"v":1e-06,"d":"0"}},8,{"$f":"IF(CP50=8,'JSM Jahresdauerlinie'!$E$26,Y50)","v":{"v":1e-06,"d":"0"}},8,{"$f":"IF(CR50=8,'JSM Jahresdauerlinie'!$E$26,AA50)","v":{"v":1e-06,"d":"0"}},{"$nulls":3},{"$f":"IF(D50=8,'JSM Jahresdauerlinie'!$E$26,IF(BW50=0,\" \",BW50))","v":{"v":1e-06,"d":"0"}},{"$f":"IF(F50=8,'JSM Jahresdauerlinie'!$E$26,IF(BY50=0,\" \",BY50))","v":{"v":1e-06,"d":"0"}},{"$f":"IF(H50=8,'JSM Jahresdauerlinie'!$E$26,IF(CA50=0,\" \",CA50))","v":{"v":1e-06,"d":"0"}},{"$f":"IF(J50=8,'JSM Jahresdauerlinie'!$E$26,IF(CC50=0,\" \",CC50))","v":{"v":1e-06,"d":"0"}},{"$f":"IF(L50=8,'JSM Jahresdauerlinie'!$E$26,IF(CE50=0,\" \",CE50))","v":{"v":1e-06,"d":"0"}},{"$f":"IF(N50=8,'JSM Jahresdauerlinie'!$E$26,IF(CG50=0,\" \",CG50))","v":{"v":1e-06,"d":"0"}},{"$f":"IF(P50=8,'JSM Jahresdauerlinie'!$E$26,IF(CI50=0,\" \",CI50))","v":{"v":1e-06,"d":"0"}},{"$f":"IF(R50=8,'JSM Jahresdauerlinie'!$E$26,IF(CK50=0,\" \",CK50))","v":{"v":1e-06,"d":"0"}},{"$f":"IF(T50=8,'JSM Jahresdauerlinie'!$E$26,IF(CM50=0,\" \",CM50))","v":{"v":1e-06,"d":"0"}},{"$f":"IF(V50=8,'JSM Jahresdauerlinie'!$E$26,IF(CO50=0,\" \",CO50))","v":{"v":1e-06,"d":"0"}},{"$f":"IF(X50=8,'JSM Jahresdauerlinie'!$E$26,IF(CQ50=0,\" \",CQ50))","v":{"v":1e-06,"d":"0"}},{"$f":"IF(Z50=8,'JSM Jahresdauerlinie'!$E$26,IF(CS50=0,\" \",CS50))","v":{"v":1e-06,"d":"0"}},null,{"v":1e-06,"d":"0"},{"v":1e-06,"d":"0"},{"v":1e-06,"d":"0"},{"v":1e-06,"d":"0"},{"v":1e-06,"d":"0"},{"v":1e-06,"d":"0"},{"v":1e-06,"d":"0"},{"v":1e-06,"d":"0"},{"v":1e-06,"d":"0"},{"v":1e-06,"d":"0"},{"v":1e-06,"d":"0"},{"v":1e-06,"d":"0"},null,null,8,8,8,8,8,8,8,8,8,8,8,8,null," "," "," "," "," "," "," "," "," "," "," "," "," "," "," "," "," "," "," "," "," "," "," "," "]
[null,20,{"$nulls":29}," "," "," "," "," "," "," "," "," "," "," "," ",{"$nulls":3},0,"",0,"",0,"",0,"",0,"",0,"",0,"",0,"",0,"",0,"",0,"",0,"",{"$nulls":3},8,{"$f":"IF(BV51=8,'JSM Jahresdauerlinie'!$E$26,E51)","v":{"v":1e-06,"d":"0"}},8,{"$f":"IF(BX51=8,'JSM Jahresdauerlinie'!$E$26,G51)","v":{"v":1e-06,"d":"0"}},8,{"$f":"IF(BZ51=8,'JSM Jahresdauerlinie'!$E$26,I51)","v":{"v":1e-06,"d":"0"}},8,{"$f":"IF(CB51=8,'JSM Jahresdauerlinie'!$E$26,K51)","v":{"v":1e-06,"d":"0"}},8,{"$f":"IF(CD51=8,'JSM Jahresdauerlinie'!$E$26,M51)","v":{"v":1e-06,"d":"0"}},8,{"$f":"IF(CF51=8,'JSM Jahresdauerlinie'!$E$26,O51)","v":{"v":1e-06,"d":"0"}},8,{"$f":"IF(CH51=8,'JSM Jahresdauerlinie'!$E$26,Q51)","v":{"v":1e-06,"d":"0"}},8,{"$f":"IF(CJ51=8,'JSM Jahresdauerlinie'!$E$26,S51)","v":{"v":1e-06,"d":"0"}},8,{"$f":"IF(CL51=8,'JSM Jahresdauerlinie'!$E$26,U51)","v":{"v":1e-06,"d":"0"}},8,{"$f":"IF(CN51=8,'JSM Jahresdauerlinie'!$E$26,W51)","v":{"v":1e-06,"d":"0"}},8,{"$f":"IF(CP51=8,'JSM Jahresdauerlinie'!$E$26,Y51)","v":{"v":1e-06,"d":"0"}},8,{"$f":"IF(CR51=8,'JSM Jahresdauerlinie'!$E$26,AA51)","v":{"v":1e-06,"d":"0"}},{"$nulls":3},{"$f":"IF(D51=8,'JSM Jahresdauerlinie'!$E$26,IF(BW51=0,\" \",BW51))","v":{"v":1e-06,"d":"0"}},{"$f":"IF(F51=8,'JSM Jahresdauerlinie'!$E$26,IF(BY51=0,\" \",BY51))","v":{"v":1e-06,"d":"0"}},{"$f":"IF(H51=8,'JSM Jahresdauerlinie'!$E$26,IF(CA51=0,\" \",CA51))","v":{"v":1e-06,"d":"0"}},{"$f":"IF(J51=8,'JSM Jahresdauerlinie'!$E$26,IF(CC51=0,\" \",CC51))","v":{"v":1e-06,"d":"0"}},{"$f":"IF(L51=8,'JSM Jahresdauerlinie'!$E$26,IF(CE51=0,\" \",CE51))","v":{"v":1e-06,"d":"0"}},{"$f":"IF(N51=8,'JSM Jahresdauerlinie'!$E$26,IF(CG51=0,\" \",CG51))","v":{"v":1e-06,"d":"0"}},{"$f":"IF(P51=8,'JSM Jahresdauerlinie'!$E$26,IF(CI51=0,\" \",CI51))","v":{"v":1e-06,"d":"0"}},{"$f":"IF(R51=8,'JSM Jahresdauerlinie'!$E$26,IF(CK51=0,\" \",CK51))","v":{"v":1e-06,"d":"0"}},{"$f":"IF(T51=8,'JSM Jahresdauerlinie'!$E$26,IF(CM51=0,\" \",CM51))","v":{"v":1e-06,"d":"0"}},{"$f":"IF(V51=8,'JSM Jahresdauerlinie'!$E$26,IF(CO51=0,\" \",CO51))","v":{"v":1e-06,"d":"0"}},{"$f":"IF(X51=8,'JSM Jahresdauerlinie'!$E$26,IF(CQ51=0,\" \",CQ51))","v":{"v":1e-06,"d":"0"}},{"$f":"IF(Z51=8,'JSM Jahresdauerlinie'!$E$26,IF(CS51=0,\" \",CS51))","v":{"v":1e-06,"d":"0"}},null,{"v":1e-06,"d":"0"},{"v":1e-06,"d":"0"},{"v":1e-06,"d":"0"},{"v":1e-06,"d":"0"},{"v":1e-06,"d":"0"},{"v":1e-06,"d":"0"},{"v":1e-06,"d":"0"},{"v":1e-06,"d":"0"},{"v":1e-06,"d":"0"},{"v":1e-06,"d":"0"},{"v":1e-06,"d":"0"},{"v":1e-06,"d":"0"},null,null,8,8,8,8,8,8,8,8,8,8,8,8,null," "," "," "," "," "," "," "," "," "," "," "," "," "," "," "," "," "," "," "," "," "," "," "," "]
[null,21,{"$nulls":29}," "," "," "," "," "," "," "," "," "," "," "," ",{"$nulls":3},0,"",0,"",0,"",0,"",0,"",0,"",0,"",0,"",0,"",0,"",0,"",0,"",{"$nulls":3},8,{"$f":"IF(BV52=8,'JSM Jahresdauerlinie'!$E$26,E52)","v":{"v":1e-06,"d":"0"}},8,{"$f":"IF(BX52=8,'JSM Jahresdauerlinie'!$E$26,G52)","v":{"v":1e-06,"d":"0"}},8,{"$f":"IF(BZ52=8,'JSM Jahresdauerlinie'!$E$26,I52)","v":{"v":1e-06,"d":"0"}},8,{"$f":"IF(CB52=8,'JSM Jahresdauerlinie'!$E$26,K52)","v":{"v":1e-06,"d":"0"}},8,{"$f":"IF(CD52=8,'JSM Jahresdauerlinie'!$E$26,M52)","v":{"v":1e-06,"d":"0"}},8,{"$f":"IF(CF52=8,'JSM Jahresdauerlinie'!$E$26,O52)","v":{"v":1e-06,"d":"0"}},8,{"$f":"IF(CH52=8,'JSM Jahresdauerlinie'!$E$26,Q52)","v":{"v":1e-06,"d":"0"}},8,{"$f":"IF(CJ52=8,'JSM Jahresdauerlinie'!$E$26,S52)","v":{"v":1e-06,"d":"0"}},8,{"$f":"IF(CL52=8,'JSM Jahresdauerlinie'!$E$26,U52)","v":{"v":1e-06,"d":"0"}},8,{"$f":"IF(CN52=8,'JSM Jahresdauerlinie'!$E$26,W52)","v":{"v":1e-06,"d":"0"}},8,{"$f":"IF(CP52=8,'JSM Jahresdauerlinie'!$E$26,Y52)","v":{"v":1e-06,"d":"0"}},8,{"$f":"IF(CR52=8,'JSM Jahresdauerlinie'!$E$26,AA52)","v":{"v":1e-06,"d":"0"}},{"$nulls":3},{"$f":"IF(D52=8,'JSM Jahresdauerlinie'!$E$26,IF(BW52=0,\" \",BW52))","v":{"v":1e-06,"d":"0"}},{"$f":"IF(F52=8,'JSM Jahresdauerlinie'!$E$26,IF(BY52=0,\" \",BY52))","v":{"v":1e-06,"d":"0"}},{"$f":"IF(H52=8,'JSM Jahresdauerlinie'!$E$26,IF(CA52=0,\" \",CA52))","v":{"v":1e-06,"d":"0"}},{"$f":"IF(J52=8,'JSM Jahresdauerlinie'!$E$26,IF(CC52=0,\" \",CC52))","v":{"v":1e-06,"d":"0"}},{"$f":"IF(L52=8,'JSM Jahresdauerlinie'!$E$26,IF(CE52=0,\" \",CE52))","v":{"v":1e-06,"d":"0"}},{"$f":"IF(N52=8,'JSM Jahresdauerlinie'!$E$26,IF(CG52=0,\" \",CG52))","v":{"v":1e-06,"d":"0"}},{"$f":"IF(P52=8,'JSM Jahresdauerlinie'!$E$26,IF(CI52=0,\" \",CI52))","v":{"v":1e-06,"d":"0"}},{"$f":"IF(R52=8,'JSM Jahresdauerlinie'!$E$26,IF(CK52=0,\" \",CK52))","v":{"v":1e-06,"d":"0"}},{"$f":"IF(T52=8,'JSM Jahresdauerlinie'!$E$26,IF(CM52=0,\" \",CM52))","v":{"v":1e-06,"d":"0"}},{"$f":"IF(V52=8,'JSM Jahresdauerlinie'!$E$26,IF(CO52=0,\" \",CO52))","v":{"v":1e-06,"d":"0"}},{"$f":"IF(X52=8,'JSM Jahresdauerlinie'!$E$26,IF(CQ52=0,\" \",CQ52))","v":{"v":1e-06,"d":"0"}},{"$f":"IF(Z52=8,'JSM Jahresdauerlinie'!$E$26,IF(CS52=0,\" \",CS52))","v":{"v":1e-06,"d":"0"}},null,{"v":1e-06,"d":"0"},{"v":1e-06,"d":"0"},{"v":1e-06,"d":"0"},{"v":1e-06,"d":"0"},{"v":1e-06,"d":"0"},{"v":1e-06,"d":"0"},{"v":1e-06,"d":"0"},{"v":1e-06,"d":"0"},{"v":1e-06,"d":"0"},{"v":1e-06,"d":"0"},{"v":1e-06,"d":"0"},{"v":1e-06,"d":"0"},null,null,8,8,8,8,8,8,8,8,8,8,8,8,null," "," "," "," "," "," "," "," "," "," "," "," "," "," "," "," "," "," "," "," "," "," "," "," "]
[null,22,{"$nulls":29}," "," "," "," "," "," "," "," "," "," "," "," ",{"$nulls":3},0,"",0,"",0,"",0,"",0,"",0,"",0,"",0,"",0,"",0,"",0,"",0,"",{"$nulls":3},8,{"$f":"IF(BV53=8,'JSM Jahresdauerlinie'!$E$26,E53)","v":{"v":1e-06,"d":"0"}},8,{"$f":"IF(BX53=8,'JSM Jahresdauerlinie'!$E$26,G53)","v":{"v":1e-06,"d":"0"}},8,{"$f":"IF(BZ53=8,'JSM Jahresdauerlinie'!$E$26,I53)","v":{"v":1e-06,"d":"0"}},8,{"$f":"IF(CB53=8,'JSM Jahresdauerlinie'!$E$26,K53)","v":{"v":1e-06,"d":"0"}},8,{"$f":"IF(CD53=8,'JSM Jahresdauerlinie'!$E$26,M53)","v":{"v":1e-06,"d":"0"}},8,{"$f":"IF(CF53=8,'JSM Jahresdauerlinie'!$E$26,O53)","v":{"v":1e-06,"d":"0"}},8,{"$f":"IF(CH53=8,'JSM Jahresdauerlinie'!$E$26,Q53)","v":{"v":1e-06,"d":"0"}},8,{"$f":"IF(CJ53=8,'JSM Jahresdauerlinie'!$E$26,S53)","v":{"v":1e-06,"d":"0"}},8,{"$f":"IF(CL53=8,'JSM Jahresdauerlinie'!$E$26,U53)","v":{"v":1e-06,"d":"0"}},8,{"$f":"IF(CN53=8,'JSM Jahresdauerlinie'!$E$26,W53)","v":{"v":1e-06,"d":"0"}},8,{"$f":"IF(CP53=8,'JSM Jahresdauerlinie'!$E$26,Y53)","v":{"v":1e-06,"d":"0"}},8,{"$f":"IF(CR53=8,'JSM Jahresdauerlinie'!$E$26,AA53)","v":{"v":1e-06,"d":"0"}},{"$nulls":3},{"$f":"IF(D53=8,'JSM Jahresdauerlinie'!$E$26,IF(BW53=0,\" \",BW53))","v":{"v":1e-06,"d":"0"}},{"$f":"IF(F53=8,'JSM Jahresdauerlinie'!$E$26,IF(BY53=0,\" \",BY53))","v":{"v":1e-06,"d":"0"}},{"$f":"IF(H53=8,'JSM Jahresdauerlinie'!$E$26,IF(CA53=0,\" \",CA53))","v":{"v":1e-06,"d":"0"}},{"$f":"IF(J53=8,'JSM Jahresdauerlinie'!$E$26,IF(CC53=0,\" \",CC53))","v":{"v":1e-06,"d":"0"}},{"$f":"IF(L53=8,'JSM Jahresdauerlinie'!$E$26,IF(CE53=0,\" \",CE53))","v":{"v":1e-06,"d":"0"}},{"$f":"IF(N53=8,'JSM Jahresdauerlinie'!$E$26,IF(CG53=0,\" \",CG53))","v":{"v":1e-06,"d":"0"}},{"$f":"IF(P53=8,'JSM Jahresdauerlinie'!$E$26,IF(CI53=0,\" \",CI53))","v":{"v":1e-06,"d":"0"}},{"$f":"IF(R53=8,'JSM Jahresdauerlinie'!$E$26,IF(CK53=0,\" \",CK53))","v":{"v":1e-06,"d":"0"}},{"$f":"IF(T53=8,'JSM Jahresdauerlinie'!$E$26,IF(CM53=0,\" \",CM53))","v":{"v":1e-06,"d":"0"}},{"$f":"IF(V53=8,'JSM Jahresdauerlinie'!$E$26,IF(CO53=0,\" \",CO53))","v":{"v":1e-06,"d":"0"}},{"$f":"IF(X53=8,'JSM Jahresdauerlinie'!$E$26,IF(CQ53=0,\" \",CQ53))","v":{"v":1e-06,"d":"0"}},{"$f":"IF(Z53=8,'JSM Jahresdauerlinie'!$E$26,IF(CS53=0,\" \",CS53))","v":{"v":1e-06,"d":"0"}},null,{"v":1e-06,"d":"0"},{"v":1e-06,"d":"0"},{"v":1e-06,"d":"0"},{"v":1e-06,"d":"0"},{"v":1e-06,"d":"0"},{"v":1e-06,"d":"0"},{"v":1e-06,"d":"0"},{"v":1e-06,"d":"0"},{"v":1e-06,"d":"0"},{"v":1e-06,"d":"0"},{"v":1e-06,"d":"0"},{"v":1e-06,"d":"0"},null,null,8,8,8,8,8,8,8,8,8,8,8,8,null," "," "," "," "," "," "," "," "," "," "," "," "," "," "," "," "," "," "," "," "," "," "," "," "]
[null,23,{"$nulls":29}," "," "," "," "," "," "," "," "," "," "," "," ",{"$nulls":3},0,"",0,"",0,"",0,"",0,"",0,"",0,"",0,"",0,"",0,"",0,"",0,"",{"$nulls":3},8,{"$f":"IF(BV54=8,'JSM Jahresdauerlinie'!$E$26,E54)","v":{"v":1e-06,"d":"0"}},8,{"$f":"IF(BX54=8,'JSM Jahresdauerlinie'!$E$26,G54)","v":{"v":1e-06,"d":"0"}},8,{"$f":"IF(BZ54=8,'JSM Jahresdauerlinie'!$E$26,I54)","v":{"v":1e-06,"d":"0"}},8,{"$f":"IF(CB54=8,'JSM Jahresdauerlinie'!$E$26,K54)","v":{"v":1e-06,"d":"0"}},8,{"$f":"IF(CD54=8,'JSM Jahresdauerlinie'!$E$26,M54)","v":{"v":1e-06,"d":"0"}},8,{"$f":"IF(CF54=8,'JSM Jahresdauerlinie'!$E$26,O54)","v":{"v":1e-06,"d":"0"}},8,{"$f":"IF(CH54=8,'JSM Jahresdauerlinie'!$E$26,Q54)","v":{"v":1e-06,"d":"0"}},8,{"$f":"IF(CJ54=8,'JSM Jahresdauerlinie'!$E$26,S54)","v":{"v":1e-06,"d":"0"}},8,{"$f":"IF(CL54=8,'JSM Jahresdauerlinie'!$E$26,U54)","v":{"v":1e-06,"d":"0"}},8,{"$f":"IF(CN54=8,'JSM Jahresdauerlinie'!$E$26,W54)","v":{"v":1e-06,"d":"0"}},8,{"$f":"IF(CP54=8,'JSM Jahresdauerlinie'!$E$26,Y54)","v":{"v":1e-06,"d":"0"}},8,{"$f":"IF(CR54=8,'JSM Jahresdauerlinie'!$E$26,AA54)","v":{"v":1e-06,"d":"0"}},{"$nulls":3},{"$f":"IF(D54=8,'JSM Jahresdauerlinie'!$E$26,IF(BW54=0,\" \",BW54))","v":{"v":1e-06,"d":"0"}},{"$f":"IF(F54=8,'JSM Jahresdauerlinie'!$E$26,IF(BY54=0,\" \",BY54))","v":{"v":1e-06,"d":"0"}},{"$f":"IF(H54=8,'JSM Jahresdauerlinie'!$E$26,IF(CA54=0,\" \",CA54))","v":{"v":1e-06,"d":"0"}},{"$f":"IF(J54=8,'JSM Jahresdauerlinie'!$E$26,IF(CC54=0,\" \",CC54))","v":{"v":1e-06,"d":"0"}},{"$f":"IF(L54=8,'JSM Jahresdauerlinie'!$E$26,IF(CE54=0,\" \",CE54))","v":{"v":1e-06,"d":"0"}},{"$f":"IF(N54=8,'JSM Jahresdauerlinie'!$E$26,IF(CG54=0,\" \",CG54))","v":{"v":1e-06,"d":"0"}},{"$f":"IF(P54=8,'JSM Jahresdauerlinie'!$E$26,IF(CI54=0,\" \",CI54))","v":{"v":1e-06,"d":"0"}},{"$f":"IF(R54=8,'JSM Jahresdauerlinie'!$E$26,IF(CK54=0,\" \",CK54))","v":{"v":1e-06,"d":"0"}},{"$f":"IF(T54=8,'JSM Jahresdauerlinie'!$E$26,IF(CM54=0,\" \",CM54))","v":{"v":1e-06,"d":"0"}},{"$f":"IF(V54=8,'JSM Jahresdauerlinie'!$E$26,IF(CO54=0,\" \",CO54))","v":{"v":1e-06,"d":"0"}},{"$f":"IF(X54=8,'JSM Jahresdauerlinie'!$E$26,IF(CQ54=0,\" \",CQ54))","v":{"v":1e-06,"d":"0"}},{"$f":"IF(Z54=8,'JSM Jahresdauerlinie'!$E$26,IF(CS54=0,\" \",CS54))","v":{"v":1e-06,"d":"0"}},null,{"v":1e-06,"d":"0"},{"v":1e-06,"d":"0"},{"v":1e-06,"d":"0"},{"v":1e-06,"d":"0"},{"v":1e-06,"d":"0"},{"v":1e-06,"d":"0"},{"v":1e-06,"d":"0"},{"v":1e-06,"d":"0"},{"v":1e-06,"d":"0"},{"v":1e-06,"d":"0"},{"v":1e-06,"d":"0"},{"v":1e-06,"d":"0"},null,null,8,8,8,8,8,8,8,8,8,8,8,8,null," "," "," "," "," "," "," "," "," "," "," "," "," "," "," "," "," "," "," "," "," "," "," "," "]
[null,24,{"$nulls":29}," "," "," "," "," "," "," "," "," "," "," "," ",{"$nulls":3},0,"",0,"",0,"",0,"",0,"",0,"",0,"",0,"",0,"",0,"",0,"",0,"",{"$nulls":3},8,{"$f":"IF(BV55=8,'JSM Jahresdauerlinie'!$E$26,E55)","v":{"v":1e-06,"d":"0"}},8,{"$f":"IF(BX55=8,'JSM Jahresdauerlinie'!$E$26,G55)","v":{"v":1e-06,"d":"0"}},8,{"$f":"IF(BZ55=8,'JSM Jahresdauerlinie'!$E$26,I55)","v":{"v":1e-06,"d":"0"}},8,{"$f":"IF(CB55=8,'JSM Jahresdauerlinie'!$E$26,K55)","v":{"v":1e-06,"d":"0"}},8,{"$f":"IF(CD55=8,'JSM Jahresdauerlinie'!$E$26,M55)","v":{"v":1e-06,"d":"0"}},8,{"$f":"IF(CF55=8,'JSM Jahresdauerlinie'!$E$26,O55)","v":{"v":1e-06,"d":"0"}},8,{"$f":"IF(CH55=8,'JSM Jahresdauerlinie'!$E$26,Q55)","v":{"v":1e-06,"d":"0"}},8,{"$f":"IF(CJ55=8,'JSM Jahresdauerlinie'!$E$26,S55)","v":{"v":1e-06,"d":"0"}},8,{"$f":"IF(CL55=8,'JSM Jahresdauerlinie'!$E$26,U55)","v":{"v":1e-06,"d":"0"}},8,{"$f":"IF(CN55=8,'JSM Jahresdauerlinie'!$E$26,W55)","v":{"v":1e-06,"d":"0"}},8,{"$f":"IF(CP55=8,'JSM Jahresdauerlinie'!$E$26,Y55)","v":{"v":1e-06,"d":"0"}},8,{"$f":"IF(CR55=8,'JSM Jahresdauerlinie'!$E$26,AA55)","v":{"v":1e-06,"d":"0"}},{"$nulls":3},{"$f":"IF(D55=8,'JSM Jahresdauerlinie'!$E$26,IF(BW55=0,\" \",BW55))","v":{"v":1e-06,"d":"0"}},{"$f":"IF(F55=8,'JSM Jahresdauerlinie'!$E$26,IF(BY55=0,\" \",BY55))","v":{"v":1e-06,"d":"0"}},{"$f":"IF(H55=8,'JSM Jahresdauerlinie'!$E$26,IF(CA55=0,\" \",CA55))","v":{"v":1e-06,"d":"0"}},{"$f":"IF(J55=8,'JSM Jahresdauerlinie'!$E$26,IF(CC55=0,\" \",CC55))","v":{"v":1e-06,"d":"0"}},{"$f":"IF(L55=8,'JSM Jahresdauerlinie'!$E$26,IF(CE55=0,\" \",CE55))","v":{"v":1e-06,"d":"0"}},{"$f":"IF(N55=8,'JSM Jahresdauerlinie'!$E$26,IF(CG55=0,\" \",CG55))","v":{"v":1e-06,"d":"0"}},{"$f":"IF(P55=8,'JSM Jahresdauerlinie'!$E$26,IF(CI55=0,\" \",CI55))","v":{"v":1e-06,"d":"0"}},{"$f":"IF(R55=8,'JSM Jahresdauerlinie'!$E$26,IF(CK55=0,\" \",CK55))","v":{"v":1e-06,"d":"0"}},{"$f":"IF(T55=8,'JSM Jahresdauerlinie'!$E$26,IF(CM55=0,\" \",CM55))","v":{"v":1e-06,"d":"0"}},{"$f":"IF(V55=8,'JSM Jahresdauerlinie'!$E$26,IF(CO55=0,\" \",CO55))","v":{"v":1e-06,"d":"0"}},{"$f":"IF(X55=8,'JSM Jahresdauerlinie'!$E$26,IF(CQ55=0,\" \",CQ55))","v":{"v":1e-06,"d":"0"}},{"$f":"IF(Z55=8,'JSM Jahresdauerlinie'!$E$26,IF(CS55=0,\" \",CS55))","v":{"v":1e-06,"d":"0"}},null,{"v":1e-06,"d":"0"},{"v":1e-06,"d":"0"},{"v":1e-06,"d":"0"},{"v":1e-06,"d":"0"},{"v":1e-06,"d":"0"},{"v":1e-06,"d":"0"},{"v":1e-06,"d":"0"},{"v":1e-06,"d":"0"},{"v":1e-06,"d":"0"},{"v":1e-06,"d":"0"},{"v":1e-06,"d":"0"},{"v":1e-06,"d":"0"},null,null,8,8,8,8,8,8,8,8,8,8,8,8,null," "," "," "," "," "," "," "," "," "," "," "," "," "," "," "," "," "," "," "," "," "," "," "," "]
[null,25,{"$nulls":29}," "," "," "," "," "," "," "," "," "," "," "," ",{"$nulls":3},0,"",0,"",0,"",0,"",0,"",0,"",0,"",0,"",0,"",0,"",0,"",0,"",{"$nulls":3},8,{"$f":"IF(BV56=8,'JSM Jahresdauerlinie'!$E$26,E56)","v":{"v":1e-06,"d":"0"}},8,{"$f":"IF(BX56=8,'JSM Jahresdauerlinie'!$E$26,G56)","v":{"v":1e-06,"d":"0"}},8,{"$f":"IF(BZ56=8,'JSM Jahresdauerlinie'!$E$26,I56)","v":{"v":1e-06,"d":"0"}},8,{"$f":"IF(CB56=8,'JSM Jahresdauerlinie'!$E$26,K56)","v":{"v":1e-06,"d":"0"}},8,{"$f":"IF(CD56=8,'JSM Jahresdauerlinie'!$E$26,M56)","v":{"v":1e-06,"d":"0"}},8,{"$f":"IF(CF56=8,'JSM Jahresdauerlinie'!$E$26,O56)","v":{"v":1e-06,"d":"0"}},8,{"$f":"IF(CH56=8,'JSM Jahresdauerlinie'!$E$26,Q56)","v":{"v":1e-06,"d":"0"}},8,{"$f":"IF(CJ56=8,'JSM Jahresdauerlinie'!$E$26,S56)","v":{"v":1e-06,"d":"0"}},8,{"$f":"IF(CL56=8,'JSM Jahresdauerlinie'!$E$26,U56)","v":{"v":1e-06,"d":"0"}},8,{"$f":"IF(CN56=8,'JSM Jahresdauerlinie'!$E$26,W56)","v":{"v":1e-06,"d":"0"}},8,{"$f":"IF(CP56=8,'JSM Jahresdauerlinie'!$E$26,Y56)","v":{"v":1e-06,"d":"0"}},8,{"$f":"IF(CR56=8,'JSM Jahresdauerlinie'!$E$26,AA56)","v":{"v":1e-06,"d":"0"}},{"$nulls":3},{"$f":"IF(D56=8,'JSM Jahresdauerlinie'!$E$26,IF(BW56=0,\" \",BW56))","v":{"v":1e-06,"d":"0"}},{"$f":"IF(F56=8,'JSM Jahresdauerlinie'!$E$26,IF(BY56=0,\" \",BY56))","v":{"v":1e-06,"d":"0"}},{"$f":"IF(H56=8,'JSM Jahresdauerlinie'!$E$26,IF(CA56=0,\" \",CA56))","v":{"v":1e-06,"d":"0"}},{"$f":"IF(J56=8,'JSM Jahresdauerlinie'!$E$26,IF(CC56=0,\" \",CC56))","v":{"v":1e-06,"d":"0"}},{"$f":"IF(L56=8,'JSM Jahresdauerlinie'!$E$26,IF(CE56=0,\" \",CE56))","v":{"v":1e-06,"d":"0"}},{"$f":"IF(N56=8,'JSM Jahresdauerlinie'!$E$26,IF(CG56=0,\" \",CG56))","v":{"v":1e-06,"d":"0"}},{"$f":"IF(P56=8,'JSM Jahresdauerlinie'!$E$26,IF(CI56=0,\" \",CI56))","v":{"v":1e-06,"d":"0"}},{"$f":"IF(R56=8,'JSM Jahresdauerlinie'!$E$26,IF(CK56=0,\" \",CK56))","v":{"v":1e-06,"d":"0"}},{"$f":"IF(T56=8,'JSM Jahresdauerlinie'!$E$26,IF(CM56=0,\" \",CM56))","v":{"v":1e-06,"d":"0"}},{"$f":"IF(V56=8,'JSM Jahresdauerlinie'!$E$26,IF(CO56=0,\" \",CO56))","v":{"v":1e-06,"d":"0"}},{"$f":"IF(X56=8,'JSM Jahresdauerlinie'!$E$26,IF(CQ56=0,\" \",CQ56))","v":{"v":1e-06,"d":"0"}},{"$f":"IF(Z56=8,'JSM Jahresdauerlinie'!$E$26,IF(CS56=0,\" \",CS56))","v":{"v":1e-06,"d":"0"}},null,{"v":1e-06,"d":"0"},{"v":1e-06,"d":"0"},{"v":1e-06,"d":"0"},{"v":1e-06,"d":"0"},{"v":1e-06,"d":"0"},{"v":1e-06,"d":"0"},{"v":1e-06,"d":"0"},{"v":1e-06,"d":"0"},{"v":1e-06,"d":"0"},{"v":1e-06,"d":"0"},{"v":1e-06,"d":"0"},{"v":1e-06,"d":"0"},null,null,8,8,8,8,8,8,8,8,8,8,8,8,null," "," "," "," "," "," "," "," "," "," "," "," "," "," "," "," "," "," "," "," "," "," "," "," "]
[null,26,{"$nulls":29}," "," "," "," "," "," "," "," "," "," "," "," ",{"$nulls":3},0,"",0,"",0,"",0,"",0,"",0,"",0,"",0,"",0,"",0,"",0,"",0,"",{"$nulls":3},8,{"$f":"IF(BV57=8,'JSM Jahresdauerlinie'!$E$26,E57)","v":{"v":1e-06,"d":"0"}},8,{"$f":"IF(BX57=8,'JSM Jahresdauerlinie'!$E$26,G57)","v":{"v":1e-06,"d":"0"}},8,{"$f":"IF(BZ57=8,'JSM Jahresdauerlinie'!$E$26,I57)","v":{"v":1e-06,"d":"0"}},8,{"$f":"IF(CB57=8,'JSM Jahresdauerlinie'!$E$26,K57)","v":{"v":1e-06,"d":"0"}},8,{"$f":"IF(CD57=8,'JSM Jahresdauerlinie'!$E$26,M57)","v":{"v":1e-06,"d":"0"}},8,{"$f":"IF(CF57=8,'JSM Jahresdauerlinie'!$E$26,O57)","v":{"v":1e-06,"d":"0"}},8,{"$f":"IF(CH57=8,'JSM Jahresdauerlinie'!$E$26,Q57)","v":{"v":1e-06,"d":"0"}},8,{"$f":"IF(CJ57=8,'JSM Jahresdauerlinie'!$E$26,S57)","v":{"v":1e-06,"d":"0"}},8,{"$f":"IF(CL57=8,'JSM Jahresdauerlinie'!$E$26,U57)","v":{"v":1e-06,"d":"0"}},8,{"$f":"IF(CN57=8,'JSM Jahresdauerlinie'!$E$26,W57)","v":{"v":1e-06,"d":"0"}},8,{"$f":"IF(CP57=8,'JSM Jahresdauerlinie'!$E$26,Y57)","v":{"v":1e-06,"d":"0"}},8,{"$f":"IF(CR57=8,'JSM Jahresdauerlinie'!$E$26,AA57)","v":{"v":1e-06,"d":"0"}},{"$nulls":3},{"$f":"IF(D57=8,'JSM Jahresdauerlinie'!$E$26,IF(BW57=0,\" \",BW57))","v":{"v":1e-06,"d":"0"}},{"$f":"IF(F57=8,'JSM Jahresdauerlinie'!$E$26,IF(BY57=0,\" \",BY57))","v":{"v":1e-06,"d":"0"}},{"$f":"IF(H57=8,'JSM Jahresdauerlinie'!$E$26,IF(CA57=0,\" \",CA57))","v":{"v":1e-06,"d":"0"}},{"$f":"IF(J57=8,'JSM Jahresdauerlinie'!$E$26,IF(CC57=0,\" \",CC57))","v":{"v":1e-06,"d":"0"}},{"$f":"IF(L57=8,'JSM Jahresdauerlinie'!$E$26,IF(CE57=0,\" \",CE57))","v":{"v":1e-06,"d":"0"}},{"$f":"IF(N57=8,'JSM Jahresdauerlinie'!$E$26,IF(CG57=0,\" \",CG57))","v":{"v":1e-06,"d":"0"}},{"$f":"IF(P57=8,'JSM Jahresdauerlinie'!$E$26,IF(CI57=0,\" \",CI57))","v":{"v":1e-06,"d":"0"}},{"$f":"IF(R57=8,'JSM Jahresdauerlinie'!$E$26,IF(CK57=0,\" \",CK57))","v":{"v":1e-06,"d":"0"}},{"$f":"IF(T57=8,'JSM Jahresdauerlinie'!$E$26,IF(CM57=0,\" \",CM57))","v":{"v":1e-06,"d":"0"}},{"$f":"IF(V57=8,'JSM Jahresdauerlinie'!$E$26,IF(CO57=0,\" \",CO57))","v":{"v":1e-06,"d":"0"}},{"$f":"IF(X57=8,'JSM Jahresdauerlinie'!$E$26,IF(CQ57=0,\" \",CQ57))","v":{"v":1e-06,"d":"0"}},{"$f":"IF(Z57=8,'JSM Jahresdauerlinie'!$E$26,IF(CS57=0,\" \",CS57))","v":{"v":1e-06,"d":"0"}},null,{"v":1e-06,"d":"0"},{"v":1e-06,"d":"0"},{"v":1e-06,"d":"0"},{"v":1e-06,"d":"0"},{"v":1e-06,"d":"0"},{"v":1e-06,"d":"0"},{"v":1e-06,"d":"0"},{"v":1e-06,"d":"0"},{"v":1e-06,"d":"0"},{"v":1e-06,"d":"0"},{"v":1e-06,"d":"0"},{"v":1e-06,"d":"0"},null,null,8,8,8,8,8,8,8,8,8,8,8,8,null," "," "," "," "," "," "," "," "," "," "," "," "," "," "," "," "," "," "," "," "," "," "," "," "]
[null,27,{"$nulls":29}," "," "," "," "," "," "," "," "," "," "," "," ",{"$nulls":3},0,"",0,"",0,"",0,"",0,"",0,"",0,"",0,"",0,"",0,"",0,"",0,"",{"$nulls":3},8,{"$f":"IF(BV58=8,'JSM Jahresdauerlinie'!$E$26,E58)","v":{"v":1e-06,"d":"0"}},8,{"$f":"IF(BX58=8,'JSM Jahresdauerlinie'!$E$26,G58)","v":{"v":1e-06,"d":"0"}},8,{"$f":"IF(BZ58=8,'JSM Jahresdauerlinie'!$E$26,I58)","v":{"v":1e-06,"d":"0"}},8,{"$f":"IF(CB58=8,'JSM Jahresdauerlinie'!$E$26,K58)","v":{"v":1e-06,"d":"0"}},8,{"$f":"IF(CD58=8,'JSM Jahresdauerlinie'!$E$26,M58)","v":{"v":1e-06,"d":"0"}},8,{"$f":"IF(CF58=8,'JSM Jahresdauerlinie'!$E$26,O58)","v":{"v":1e-06,"d":"0"}},8,{"$f":"IF(CH58=8,'JSM Jahresdauerlinie'!$E$26,Q58)","v":{"v":1e-06,"d":"0"}},8,{"$f":"IF(CJ58=8,'JSM Jahresdauerlinie'!$E$26,S58)","v":{"v":1e-06,"d":"0"}},8,{"$f":"IF(CL58=8,'JSM Jahresdauerlinie'!$E$26,U58)","v":{"v":1e-06,"d":"0"}},8,{"$f":"IF(CN58=8,'JSM Jahresdauerlinie'!$E$26,W58)","v":{"v":1e-06,"d":"0"}},8,{"$f":"IF(CP58=8,'JSM Jahresdauerlinie'!$E$26,Y58)","v":{"v":1e-06,"d":"0"}},8,{"$f":"IF(CR58=8,'JSM Jahresdauerlinie'!$E$26,AA58)","v":{"v":1e-06,"d":"0"}},{"$nulls":3},{"$f":"IF(D58=8,'JSM Jahresdauerlinie'!$E$26,IF(BW58=0,\" \",BW58))","v":{"v":1e-06,"d":"0"}},{"$f":"IF(F58=8,'JSM Jahresdauerlinie'!$E$26,IF(BY58=0,\" \",BY58))","v":{"v":1e-06,"d":"0"}},{"$f":"IF(H58=8,'JSM Jahresdauerlinie'!$E$26,IF(CA58=0,\" \",CA58))","v":{"v":1e-06,"d":"0"}},{"$f":"IF(J58=8,'JSM Jahresdauerlinie'!$E$26,IF(CC58=0,\" \",CC58))","v":{"v":1e-06,"d":"0"}},{"$f":"IF(L58=8,'JSM Jahresdauerlinie'!$E$26,IF(CE58=0,\" \",CE58))","v":{"v":1e-06,"d":"0"}},{"$f":"IF(N58=8,'JSM Jahresdauerlinie'!$E$26,IF(CG58=0,\" \",CG58))","v":{"v":1e-06,"d":"0"}},{"$f":"IF(P58=8,'JSM Jahresdauerlinie'!$E$26,IF(CI58=0,\" \",CI58))","v":{"v":1e-06,"d":"0"}},{"$f":"IF(R58=8,'JSM Jahresdauerlinie'!$E$26,IF(CK58=0,\" \",CK58))","v":{"v":1e-06,"d":"0"}},{"$f":"IF(T58=8,'JSM Jahresdauerlinie'!$E$26,IF(CM58=0,\" \",CM58))","v":{"v":1e-06,"d":"0"}},{"$f":"IF(V58=8,'JSM Jahresdauerlinie'!$E$26,IF(CO58=0,\" \",CO58))","v":{"v":1e-06,"d":"0"}},{"$f":"IF(X58=8,'JSM Jahresdauerlinie'!$E$26,IF(CQ58=0,\" \",CQ58))","v":{"v":1e-06,"d":"0"}},{"$f":"IF(Z58=8,'JSM Jahresdauerlinie'!$E$26,IF(CS58=0,\" \",CS58))","v":{"v":1e-06,"d":"0"}},null,{"v":1e-06,"d":"0"},{"v":1e-06,"d":"0"},{"v":1e-06,"d":"0"},{"v":1e-06,"d":"0"},{"v":1e-06,"d":"0"},{"v":1e-06,"d":"0"},{"v":1e-06,"d":"0"},{"v":1e-06,"d":"0"},{"v":1e-06,"d":"0"},{"v":1e-06,"d":"0"},{"v":1e-06,"d":"0"},{"v":1e-06,"d":"0"},null,null,8,8,8,8,8,8,8,8,8,8,8,8,null," "," "," "," "," "," "," "," "," "," "," "," "," "," "," "," "," "," "," "," "," "," "," "," "]
[null,28,{"$nulls":29}," "," "," "," "," "," "," "," "," "," "," "," ",{"$nulls":3},0,"",0,"",0,"",0,"",0,"",0,"",0,"",0,"",0,"",0,"",0,"",0,"",{"$nulls":3},8,{"$f":"IF(BV59=8,'JSM Jahresdauerlinie'!$E$26,E59)","v":{"v":1e-06,"d":"0"}},8,{"$f":"IF(BX59=8,'JSM Jahresdauerlinie'!$E$26,G59)","v":{"v":1e-06,"d":"0"}},8,{"$f":"IF(BZ59=8,'JSM Jahresdauerlinie'!$E$26,I59)","v":{"v":1e-06,"d":"0"}},8,{"$f":"IF(CB59=8,'JSM Jahresdauerlinie'!$E$26,K59)","v":{"v":1e-06,"d":"0"}},8,{"$f":"IF(CD59=8,'JSM Jahresdauerlinie'!$E$26,M59)","v":{"v":1e-06,"d":"0"}},8,{"$f":"IF(CF59=8,'JSM Jahresdauerlinie'!$E$26,O59)","v":{"v":1e-06,"d":"0"}},8,{"$f":"IF(CH59=8,'JSM Jahresdauerlinie'!$E$26,Q59)","v":{"v":1e-06,"d":"0"}},8,{"$f":"IF(CJ59=8,'JSM Jahresdauerlinie'!$E$26,S59)","v":{"v":1e-06,"d":"0"}},8,{"$f":"IF(CL59=8,'JSM Jahresdauerlinie'!$E$26,U59)","v":{"v":1e-06,"d":"0"}},8,{"$f":"IF(CN59=8,'JSM Jahresdauerlinie'!$E$26,W59)","v":{"v":1e-06,"d":"0"}},8,{"$f":"IF(CP59=8,'JSM Jahresdauerlinie'!$E$26,Y59)","v":{"v":1e-06,"d":"0"}},8,{"$f":"IF(CR59=8,'JSM Jahresdauerlinie'!$E$26,AA59)","v":{"v":1e-06,"d":"0"}},{"$nulls":3},{"$f":"IF(D59=8,'JSM Jahresdauerlinie'!$E$26,IF(BW59=0,\" \",BW59))","v":{"v":1e-06,"d":"0"}},{"$f":"IF(F59=8,'JSM Jahresdauerlinie'!$E$26,IF(BY59=0,\" \",BY59))","v":{"v":1e-06,"d":"0"}},{"$f":"IF(H59=8,'JSM Jahresdauerlinie'!$E$26,IF(CA59=0,\" \",CA59))","v":{"v":1e-06,"d":"0"}},{"$f":"IF(J59=8,'JSM Jahresdauerlinie'!$E$26,IF(CC59=0,\" \",CC59))","v":{"v":1e-06,"d":"0"}},{"$f":"IF(L59=8,'JSM Jahresdauerlinie'!$E$26,IF(CE59=0,\" \",CE59))","v":{"v":1e-06,"d":"0"}},{"$f":"IF(N59=8,'JSM Jahresdauerlinie'!$E$26,IF(CG59=0,\" \",CG59))","v":{"v":1e-06,"d":"0"}},{"$f":"IF(P59=8,'JSM Jahresdauerlinie'!$E$26,IF(CI59=0,\" \",CI59))","v":{"v":1e-06,"d":"0"}},{"$f":"IF(R59=8,'JSM Jahresdauerlinie'!$E$26,IF(CK59=0,\" \",CK59))","v":{"v":1e-06,"d":"0"}},{"$f":"IF(T59=8,'JSM Jahresdauerlinie'!$E$26,IF(CM59=0,\" \",CM59))","v":{"v":1e-06,"d":"0"}},{"$f":"IF(V59=8,'JSM Jahresdauerlinie'!$E$26,IF(CO59=0,\" \",CO59))","v":{"v":1e-06,"d":"0"}},{"$f":"IF(X59=8,'JSM Jahresdauerlinie'!$E$26,IF(CQ59=0,\" \",CQ59))","v":{"v":1e-06,"d":"0"}},{"$f":"IF(Z59=8,'JSM Jahresdauerlinie'!$E$26,IF(CS59=0,\" \",CS59))","v":{"v":1e-06,"d":"0"}},null,{"v":1e-06,"d":"0"},{"v":1e-06,"d":"0"},{"v":1e-06,"d":"0"},{"v":1e-06,"d":"0"},{"v":1e-06,"d":"0"},{"v":1e-06,"d":"0"},{"v":1e-06,"d":"0"},{"v":1e-06,"d":"0"},{"v":1e-06,"d":"0"},{"v":1e-06,"d":"0"},{"v":1e-06,"d":"0"},{"v":1e-06,"d":"0"},null,null,8,8,8,8,8,8,8,8,8,8,8,8,null," "," "," "," "," "," "," "," "," "," "," "," "," "," "," "," "," "," "," "," "," "," "," "," "]
[null,29,{"$nulls":29}," "," "," "," "," "," "," "," "," "," "," "," ",{"$nulls":3},0,"",0,"",0,"",0,"",0,"",0,"",0,"",0,"",0,"",0,"",0,"",0,"",{"$nulls":3},8,{"$f":"IF(BV60=8,'JSM Jahresdauerlinie'!$E$26,E60)","v":{"v":1e-06,"d":"0"}},null," ",8,{"$f":"IF(BZ60=8,'JSM Jahresdauerlinie'!$E$26,I60)","v":{"v":1e-06,"d":"0"}},8,{"$f":"IF(CB60=8,'JSM Jahresdauerlinie'!$E$26,K60)","v":{"v":1e-06,"d":"0"}},8,{"$f":"IF(CD60=8,'JSM Jahresdauerlinie'!$E$26,M60)","v":{"v":1e-06,"d":"0"}},8,{"$f":"IF(CF60=8,'JSM Jahresdauerlinie'!$E$26,O60)","v":{"v":1e-06,"d":"0"}},8,{"$f":"IF(CH60=8,'JSM Jahresdauerlinie'!$E$26,Q60)","v":{"v":1e-06,"d":"0"}},8,{"$f":"IF(CJ60=8,'JSM Jahresdauerlinie'!$E$26,S60)","v":{"v":1e-06,"d":"0"}},8,{"$f":"IF(CL60=8,'JSM Jahresdauerlinie'!$E$26,U60)","v":{"v":1e-06,"d":"0"}},8,{"$f":"IF(CN60=8,'JSM Jahresdauerlinie'!$E$26,W60)","v":{"v":1e-06,"d":"0"}},8,{"$f":"IF(CP60=8,'JSM Jahresdauerlinie'!$E$26,Y60)","v":{"v":1e-06,"d":"0"}},8,{"$f":"IF(CR60=8,'JSM Jahresdauerlinie'!$E$26,AA60)","v":{"v":1e-06,"d":"0"}},{"$nulls":3},{"$f":"IF(D60=8,'JSM Jahresdauerlinie'!$E$26,IF(BW60=0,\" \",BW60))","v":{"v":1e-06,"d":"0"}},{"$f":"IF(F60=8,$Q$102,IF(BY60=0,\" \",BY60))","v":" "},{"$f":"IF(H60=8,'JSM Jahresdauerlinie'!$E$26,IF(CA60=0,\" \",CA60))","v":{"v":1e-06,"d":"0"}},{"$f":"IF(J60=8,'JSM Jahresdauerlinie'!$E$26,IF(CC60=0,\" \",CC60))","v":{"v":1e-06,"d":"0"}},{"$f":"IF(L60=8,'JSM Jahresdauerlinie'!$E$26,IF(CE60=0,\" \",CE60))","v":{"v":1e-06,"d":"0"}},{"$f":"IF(N60=8,'JSM Jahresdauerlinie'!$E$26,IF(CG60=0,\" \",CG60))","v":{"v":1e-06,"d":"0"}},{"$f":"IF(P60=8,'JSM Jahresdauerlinie'!$E$26,IF(CI60=0,\" \",CI60))","v":{"v":1e-06,"d":"0"}},{"$f":"IF(R60=8,'JSM Jahresdauerlinie'!$E$26,IF(CK60=0,\" \",CK60))","v":{"v":1e-06,"d":"0"}},{"$f":"IF(T60=8,'JSM Jahresdauerlinie'!$E$26,IF(CM60=0,\" \",CM60))","v":{"v":1e-06,"d":"0"}},{"$f":"IF(V60=8,'JSM Jahresdauerlinie'!$E$26,IF(CO60=0,\" \",CO60))","v":{"v":1e-06,"d":"0"}},{"$f":"IF(X60=8,'JSM Jahresdauerlinie'!$E$26,IF(CQ60=0,\" \",CQ60))","v":{"v":1e-06,"d":"0"}},{"$f":"IF(Z60=8,'JSM Jahresdauerlinie'!$E$26,IF(CS60=0,\" \",CS60))","v":{"v":1e-06,"d":"0"}},null,{"v":1e-06,"d":"0"}," ",{"v":1e-06,"d":"0"},{"v":1e-06,"d":"0"},{"v":1e-06,"d":"0"},{"v":1e-06,"d":"0"},{"v":1e-06,"d":"0"},{"v":1e-06,"d":"0"},{"v":1e-06,"d":"0"},{"v":1e-06,"d":"0"},{"v":1e-06,"d":"0"},{"v":1e-06,"d":"0"},null,null,8,0,8,8,8,8,8,8,8,8,8,8,null," "," "," "," "," "," "," "," "," "," "," "," "," "," "," "," "," "," "," "," "," "," "," "," "]
[null,30,{"$nulls":29}," "," "," "," "," "," "," "," "," "," "," "," ",{"$nulls":3},0,"",0,"",0,"",0,"",0,"",0,"",0,"",0,"",0,"",0,"",0,"",0,"",{"$nulls":3},8,{"$f":"IF(BV61=8,'JSM Jahresdauerlinie'!$E$26,E61)","v":{"v":1e-06,"d":"0"}},null," ",8,{"$f":"IF(BZ61=8,'JSM Jahresdauerlinie'!$E$26,I61)","v":{"v":1e-06,"d":"0"}},8,{"$f":"IF(CB61=8,'JSM Jahresdauerlinie'!$E$26,K61)","v":{"v":1e-06,"d":"0"}},8,{"$f":"IF(CD61=8,'JSM Jahresdauerlinie'!$E$26,M61)","v":{"v":1e-06,"d":"0"}},8,{"$f":"IF(CF61=8,'JSM Jahresdauerlinie'!$E$26,O61)","v":{"v":1e-06,"d":"0"}},8,{"$f":"IF(CH61=8,'JSM Jahresdauerlinie'!$E$26,Q61)","v":{"v":1e-06,"d":"0"}},8,{"$f":"IF(CJ61=8,'JSM Jahresdauerlinie'!$E$26,S61)","v":{"v":1e-06,"d":"0"}},8,{"$f":"IF(CL61=8,'JSM Jahresdauerlinie'!$E$26,U61)","v":{"v":1e-06,"d":"0"}},8,{"$f":"IF(CN61=8,'JSM Jahresdauerlinie'!$E$26,W61)","v":{"v":1e-06,"d":"0"}},8,{"$f":"IF(CP61=8,'JSM Jahresdauerlinie'!$E$26,Y61)","v":{"v":1e-06,"d":"0"}},8,{"$f":"IF(CR61=8,'JSM Jahresdauerlinie'!$E$26,AA61)","v":{"v":1e-06,"d":"0"}},{"$nulls":3},{"$f":"IF(D61=8,'JSM Jahresdauerlinie'!$E$26,IF(BW61=0,\" \",BW61))","v":{"v":1e-06,"d":"0"}},{"$f":"IF(F61=8,$Q$102,IF(BY61=0,\" \",BY61))","v":" "},{"$f":"IF(H61=8,'JSM Jahresdauerlinie'!$E$26,IF(CA61=0,\" \",CA61))","v":{"v":1e-06,"d":"0"}},{"$f":"IF(J61=8,'JSM Jahresdauerlinie'!$E$26,IF(CC61=0,\" \",CC61))","v":{"v":1e-06,"d":"0"}},{"$f":"IF(L61=8,'JSM Jahresdauerlinie'!$E$26,IF(CE61=0,\" \",CE61))","v":{"v":1e-06,"d":"0"}},{"$f":"IF(N61=8,'JSM Jahresdauerlinie'!$E$26,IF(CG61=0,\" \",CG61))","v":{"v":1e-06,"d":"0"}},{"$f":"IF(P61=8,'JSM Jahresdauerlinie'!$E$26,IF(CI61=0,\" \",CI61))","v":{"v":1e-06,"d":"0"}},{"$f":"IF(R61=8,'JSM Jahresdauerlinie'!$E$26,IF(CK61=0,\" \",CK61))","v":{"v":1e-06,"d":"0"}},{"$f":"IF(T61=8,'JSM Jahresdauerlinie'!$E$26,IF(CM61=0,\" \",CM61))","v":{"v":1e-06,"d":"0"}},{"$f":"IF(V61=8,'JSM Jahresdauerlinie'!$E$26,IF(CO61=0,\" \",CO61))","v":{"v":1e-06,"d":"0"}},{"$f":"IF(X61=8,'JSM Jahresdauerlinie'!$E$26,IF(CQ61=0,\" \",CQ61))","v":{"v":1e-06,"d":"0"}},{"$f":"IF(Z61=8,'JSM Jahresdauerlinie'!$E$26,IF(CS61=0,\" \",CS61))","v":{"v":1e-06,"d":"0"}},null,{"v":1e-06,"d":"0"}," ",{"v":1e-06,"d":"0"},{"v":1e-06,"d":"0"},{"v":1e-06,"d":"0"},{"v":1e-06,"d":"0"},{"v":1e-06,"d":"0"},{"v":1e-06,"d":"0"},{"v":1e-06,"d":"0"},{"v":1e-06,"d":"0"},{"v":1e-06,"d":"0"},{"v":1e-06,"d":"0"},null,null,8,0,8,8,8,8,8,8,8,8,8,8,null," "," "," "," "," "," "," "," "," "," "," "," "," "," "," "," "," "," "," "," "," "," "," "," "]
[null,31,{"$nulls":29}," "," "," "," "," "," "," "," "," "," "," "," ",{"$nulls":3},0,"",0,"",0,"",0,"",0,"",0,"",0,"",0,"",0,"",0,"",0,"",0,"",{"$nulls":3},8,{"$f":"IF(BV62=8,'JSM Jahresdauerlinie'!$E$26,E62)","v":{"v":1e-06,"d":"0"}},null," ",8,{"$f":"IF(BZ62=8,'JSM Jahresdauerlinie'!$E$26,I62)","v":{"v":1e-06,"d":"0"}},null," ",8,{"$f":"IF(CD62=8,'JSM Jahresdauerlinie'!$E$26,M62)","v":{"v":1e-06,"d":"0"}},null," ",8,{"$f":"IF(CH62=8,'JSM Jahresdauerlinie'!$E$26,Q62)","v":{"v":1e-06,"d":"0"}},8,{"$f":"IF(CJ62=8,'JSM Jahresdauerlinie'!$E$26,S62)","v":{"v":1e-06,"d":"0"}},null," ",8,{"$f":"IF(CN62=8,'JSM Jahresdauerlinie'!$E$26,W62)","v":{"v":1e-06,"d":"0"}},null," ",8,{"$f":"IF(CR62=8,'JSM Jahresdauerlinie'!$E$26,AA62)","v":{"v":1e-06,"d":"0"}},{"$nulls":3},{"$f":"IF(D62=8,'JSM Jahresdauerlinie'!$E$26,IF(BW62=0,\" \",BW62))","v":{"v":1e-06,"d":"0"}},{"$f":"IF(F62=8,$Q$102,IF(BY62=0,\" \",BY62))","v":" "},{"$f":"IF(H62=8,'JSM Jahresdauerlinie'!$E$26,IF(CA62=0,\" \",CA62))","v":{"v":1e-06,"d":"0"}},{"$f":"IF(J62=8,$Q$102,IF(CC62=0,\" \",CC62))","v":" "},{"$f":"IF(L62=8,'JSM Jahresdauerlinie'!$E$26,IF(CE62=0,\" \",CE62))","v":{"v":1e-06,"d":"0"}},{"$f":"IF(N62=8,$Q$102,IF(CG62=0,\" \",CG62))","v":" "},{"$f":"IF(P62=8,'JSM Jahresdauerlinie'!$E$26,IF(CI62=0,\" \",CI62))","v":{"v":1e-06,"d":"0"}},{"$f":"IF(R62=8,'JSM Jahresdauerlinie'!$E$26,IF(CK62=0,\" \",CK62))","v":{"v":1e-06,"d":"0"}},{"$f":"IF(T62=8,$Q$102,IF(CM62=0,\" \",CM62))","v":" "},{"$f":"IF(V62=8,'JSM Jahresdauerlinie'!$E$26,IF(CO62=0,\" \",CO62))","v":{"v":1e-06,"d":"0"}},{"$f":"IF(X62=8,$Q$102,IF(CQ62=0,\" \",CQ62))","v":" "},{"$f":"IF(Z62=8,'JSM Jahresdauerlinie'!$E$26,IF(CS62=0,\" \",CS62))","v":{"v":1e-06,"d":"0"}},null,{"v":1e-06,"d":"0"}," ",{"v":1e-06,"d":"0"}," ",{"v":1e-06,"d":"0"}," ",{"v":1e-06,"d":"0"},{"v":1e-06,"d":"0"}," ",{"v":1e-06,"d":"0"}," ",{"v":1e-06,"d":"0"},null,null,8,0,8,0,8,0,8,8,0,8,0,8,null," "," "," "," "," "," "," "," "," "," "," "," "," "," "," "," "," "," "," "," "," "," "," "," "]
[{"$nulls":27},"Jahressummen:",{"$nulls":70},"Jahressummen"]
[null,"Anzahl TW- Tage",null,null,{"$f":"IF(EL89<EL94,EL94,EL89)","v":0},null,{"$f":"IF(EN89<EN94,EN94,EN89)","v":0},null,{"$f":"IF(EP89<EP94,EP94,EP89)","v":0},null,{"$f":"IF(ER89<ER94,ER94,ER89)","v":0},null,{"$f":"IF(ET89<ET94,ET94,ET89)","v":0},null,{"$f":"IF(EV89<EV94,EV94,EV89)","v":0},null,{"$f":"IF(EX89<EX94,EX94,EX89)","v":0},null,{"$f":"IF(EZ89<EZ94,EZ94,EZ89)","v":0},null,{"$f":"IF(FB89<FB94,FB94,FB89)","v":0},null,{"$f":"IF(FD89<FD94,FD94,FD89)","v":0},null,{"$f":"IF(FF89<FF94,FF94,FF89)","v":0},null,{"$f":"IF(FH89<FH94,FH94,FH89)","v":0},{"$f":"SUM(E64:AA64)","v":0},{"$nulls":3},"Anzahl der Messwerte:"]
[null,"max. Tages-TW",null,null,{"$f":"EL92","v":" "},null,{"$f":"EN92","v":" "},null,{"$f":"EP92","v":" "},null,{"$f":"ER92","v":" "},null,{"$f":"ET92","v":" "},null,{"$f":"EV92","v":" "},null,{"$f":"EX92","v":" "},null,{"$f":"EZ92","v":" "},null,{"$f":"FB92","v":" "},null,{"$f":"FD92","v":" "},null,{"$f":"FF92","v":" "},null,{"$f":"FH92","v":" "},0,null,null,"n=",{"$f":"COUNTIF(AF32:AQ62,\">0\")","v":0}]
[null,"Gesamt der TW-Tage",null,null,{"$f":"EL88","v":0},null,{"$f":"EN88","v":0},null,{"$f":"EP88","v":0},null,{"$f":"ER88","v":0},null,{"$f":"ET88","v":0},null,{"$f":"EV88","v":0},null,{"$f":"EX88","v":0},null,{"$f":"EZ88","v":0},null,{"$f":"FB88","v":0},null,{"$f":"FD88","v":0},null,{"$f":"FF88","v":0},null,{"$f":"FH88","v":0},0]
[null,"monatl. Gesamt-TW",null,null,{"$f":"IF(E64=0,0,E93/E64*31)","v":0},null,{"$f":"IF(G64=0,0,G93/G64*28)","v":0},null,{"$f":"IF(I64=0,0,I93/I64*31)","v":0},null,{"$f":"IF(K64=0,0,K93/K64*30)","v":0},null,{"$f":"IF(M64=0,0,M93/M64*31)","v":0},null,{"$f":"IF(O64=0,0,O93/O64*30)","v":0},null,{"$f":"IF(Q64=0,0,Q93/Q64*31)","v":0},null,{"$f":"IF(S64=0,0,S93/S64*31)","v":0},null,{"$f":"IF(U64=0,0,U93/U64*30)","v":0},null,{"$f":"IF(W64=0,0,W93/W64*31)","v":0},null,{"$f":"IF(Y64=0,0,Y93/Y64*30)","v":0},null,{"$f":"IF(AA64=0,0,AA93/AA64*31)","v":0},0]
[null,"monatl. Gesamt",null,null,{"$f":"SUM(E32:E62)","v":0},null,{"$f":"SUM(G32:G62)","v":0},null,{"$f":"SUM(I32:I62)","v":0},null,{"$f":"SUM(K32:K62)","v":0},null,{"$f":"SUM(M32:M62)","v":0},null,{"$f":"SUM(O32:O62)","v":0},null,{"$f":"SUM(Q32:Q62)","v":0},null,{"$f":"SUM(S32:S62)","v":0},null,{"$f":"SUM(U32:U62)","v":0},null,{"$f":"SUM(W32:W62)","v":0},null,{"$f":"SUM(Y32:Y62)","v":0},null,{"$f":"SUM(AA32:AA62)","v":0},0]
[null,"monatl. Gesamt (einschl. Ersatzwerte)",null,null,{"$f":"SUM(BW32:BW62)","v":{"v":3.1000000000000008E-5,"d":"0"}},null,{"$f":"SUM(BY32:BY62)","v":{"v":2.800000000000001E-5,"d":"0"}},null,{"v":3.1000000000000008E-5,"d":"0"},null,{"v":3.0000000000000011E-5,"d":"0"},null,{"v":3.1000000000000008E-5,"d":"0"},null,{"v":3.0000000000000011E-5,"d":"0"},null,{"v":3.1000000000000008E-5,"d":"0"},null,{"v":3.1000000000000008E-5,"d":"0"},null,{"v":3.0000000000000011E-5,"d":"0"},null,{"v":3.1000000000000008E-5,"d":"0"},null,{"v":3.0000000000000011E-5,"d":"0"},null,{"v":3.1000000000000008E-5,"d":"0"},{"v":3.6500000000000009E-4,"d":"0"}]
[]
[{"$nulls":26},"JSM überTW nach Jahresmittel",{"$f":"IF(AB64=0,0,AB66/AB64*365)","v":0}]
[{"$nulls":26},"JSM nach den Trockenwettertagen im Jahresmittel in m³:",{"$f":"IF(AB64=0,0,AB71)","v":0}]
[{"$nulls":3},"Bemerkung"]
[]
[]
[{"$nulls":69},{"$f":"IFERROR(BR93/BR94,\"\")","v":""},{"$nulls":4},{"$f":"SUMIF(BV32:BV62,\"<=2\",BW32:BW62)","v":0},null,{"$f":"SUMIF(BX32:BX62,\"<=2\",BY32:BY62)","v":0},null,{"$f":"SUMIF(BZ32:BZ62,\"<=2\",CA32:CA62)","v":0},null,{"$f":"SUMIF(CB32:CB62,\"<=2\",CC32:CC62)","v":0},null,{"$f":"SUMIF(CD$32:CD$62,\"<=2\",CE$32:CE$62)","v":0},null,{"$f":"SUMIF(CF32:CF62,\"<=2\",CG32:CG62)","v":0},null,{"$f":"SUMIF(CH32:CH62,\"<=2\",CI32:CI62)","v":0},null,{"$f":"SUMIF(CJ32:CJ62,\"<=2\",CK32:CK62)","v":0},null,{"$f":"SUMIF(CL32:CL62,\"<=2\",CM32:CM62)","v":0},null,{"$f":"SUMIF(CN32:CN62,\"<=2\",CO32:CO62)","v":0},null,{"$f":"SUMIF(CP32:CP62,\"<=2\",CQ32:CQ62)","v":0},null,{"$f":"SUMIF(CR32:CR62,\"<=2\",CS32:CS62)","v":0},null,{"$f":"SUM(BW76:CS76)","v":0}]
[]
[{"$nulls":74},{"$f":"IF(BW94=0,0,BW76/BW94*31)","v":0},null,{"$f":"IF(BY94=0,0,BY76/BY94*28)","v":0},null,{"$f":"IF(CA94=0,0,CA76/CA94*31)","v":0},null,{"$f":"IF(CC94=0,0,CC76/CC94*30)","v":0},null,{"$f":"IF(CE94=0,0,CE76/CE94*31)","v":0},null,{"$f":"IF(CG94=0,0,CG76/CG94*30)","v":0},null,{"$f":"IF(CI94=0,0,CI76/CI94*31)","v":0},null,{"$f":"IF(CK94=0,0,CK76/CK94*31)","v":0},null,{"$f":"IF(CM94=0,0,CM76/CM94*30)","v":0},null,{"$f":"IF(CO94=0,0,CO76/CO94*31)","v":0},null,{"$f":"IF(CQ94=0,0,CQ76/CQ94*30)","v":0},null,{"$f":"IF(CS94=0,0,CS76/CS94*31)","v":0},null,{"$f":"SUM(BW78:CS78)","v":0}]
[{"$nulls":4},{"$f":"IF(AB84=365,\" \",\"Achtung, es besteht die Möglichkeit, dass beim Einkopieren von Daten ein Fehler entstanden ist. Anhand der Anzahl der Messtage überprüfen.\")","v":"Achtung, es besteht die Möglichkeit, dass beim Einkopieren von Daten ein Fehler entstanden ist. Anhand der Anzahl der Messtage überprüfen."}]
[]
[]
[]
[]
[null,"Messtage",null,null,{"$f":"COUNT(E32:E62)","v":0},null,{"$f":"COUNT(G32:G62)","v":0},null,{"$f":"COUNT(I32:I62)","v":0},null,{"$f":"COUNT(K32:K62)","v":0},null,{"$f":"COUNT(M32:M62)","v":0},null,{"$f":"COUNT(O32:O62)","v":0},null,{"$f":"COUNT(Q32:Q62)","v":0},null,{"$f":"COUNT(S32:S62)","v":0},null,{"$f":"COUNT(U32:U62)","v":0},null,{"$f":"COUNT(W32:W62)","v":0},null,{"$f":"COUNT(Y32:Y62)","v":0},null,{"$f":"COUNT(AA32:AA62)","v":0},{"$f":"SUM(E84:AA84)","v":0}]
[null,"Kleinstwert",null,null,{"$f":"IF(E84=0,\" \",SMALL(E32:E62,1))","v":" "}," "," "," "," "," "," "," "," "," "," "," "," "," "," "," "," "," "," "," "," "," "," ",{"$f":"IFERROR(SMALL(E85:AA85,1),\"\")","v":""}]
[null,"Größtwert",null,null,{"$f":"IF(E84=0,\" \",LARGE(E32:E62,1))","v":" "}," "," "," "," "," "," "," "," "," "," "," "," "," "," "," "," "," "," "," "," "," "," ",{"$f":"IFERROR(LARGE(E86:AA86,1),\"\")","v":""}]
[]
[{"$nulls":47},{"$f":"SUM(AV32:AV63)","v":0},null,{"$f":"SUM(AX32:AX63)","v":0},null,0,null,0,null,0,null,0,null,0,null,0,null,0,null,0,null,0,null,0,0,{"$nulls":3},{"$f":"SUM(BW32:BW62)","v":{"v":3.1000000000000008E-5,"d":"0 "}},null,{"$f":"SUM(BY32:BY62)","v":{"v":2.800000000000001E-5,"d":"0 "}},null,{"$f":"SUM(CA32:CA62)","v":{"v":3.1000000000000008E-5,"d":"0 "}},null,{"$f":"SUM(CC32:CC62)","v":{"v":3.0000000000000011E-5,"d":"0 "}},null,{"$f":"SUM(CE32:CE62)","v":{"v":3.1000000000000008E-5,"d":"0 "}},null,{"$f":"SUM(CG32:CG62)","v":{"v":3.0000000000000011E-5,"d":"0 "}},null,{"$f":"SUM(CI32:CI62)","v":{"v":3.1000000000000008E-5,"d":"0 "}},null,{"$f":"SUM(CK32:CK62)","v":{"v":3.1000000000000008E-5,"d":"0 "}},null,{"$f":"SUM(CM32:CM62)","v":{"v":3.0000000000000011E-5,"d":"0 "}},null,{"$f":"SUM(CO32:CO62)","v":{"v":3.1000000000000008E-5,"d":"0 "}},null,{"$f":"SUM(CQ32:CQ62)","v":{"v":3.0000000000000011E-5,"d":"0 "}},null,{"$f":"SUM(CS32:CS62)","v":{"v":3.1000000000000008E-5,"d":"0 "}},null,{"$f":"SUM(BW88:CS88)","v":{"v":3.6500000000000009E-4,"d":"0 "}},{"$nulls":42},{"$f":"SUM(EL32:EL62)","v":0},null,{"$f":"SUM(EN32:EN62)","v":0},null,{"$f":"SUM(EP32:EP62)","v":0},null,{"$f":"SUM(ER32:ER62)","v":0},null,{"$f":"SUM(ET32:ET62)","v":0},null,{"$f":"SUM(EV32:EV62)","v":0},null,{"$f":"SUM(EX32:EX62)","v":0},null,{"$f":"SUM(EZ32:EZ62)","v":0},null,{"$f":"SUM(FB32:FB62)","v":0},null,{"$f":"SUM(FD32:FD62)","v":0},null,{"$f":"SUM(FF32:FF62)","v":0},null,{"$f":"SUM(FH32:FH62)","v":0}]
[{"$nulls":31},{"$f":"COUNT(AF32:AF62)","v":0},0,0,0,0,0,0,0,0,0,0,0,{"$nulls":4},{"$f":"COUNT(AV32:AV62)","v":0},null,{"$f":"COUNT(AX32:AX62)","v":0},null,{"$f":"COUNT(AZ32:AZ62)","v":0},null,{"$f":"COUNT(BB32:BB62)","v":0},null,{"$f":"COUNT(BD32:BD62)","v":0},null,{"$f":"COUNT(BF32:BF62)","v":0},null,{"$f":"COUNT(BH32:BH62)","v":0},null,{"$f":"COUNT(BJ32:BJ62)","v":0},null,{"$f":"COUNT(BL32:BL62)","v":0},null,{"$f":"COUNT(BN32:BN62)","v":0},null,{"$f":"COUNT(BP32:BP62)","v":0},null,{"$f":"COUNT(BR32:BR62)","v":0},{"$nulls":4},{"$f":"COUNT(BW32:BW62)","v":{"v":31,"d":"31 "}},null,{"$f":"COUNT(BY32:BY62)","v":{"v":28,"d":"28 "}},null,{"$f":"COUNT(CA32:CA62)","v":{"v":31,"d":"31 "}},null,{"$f":"COUNT(CC32:CC62)","v":{"v":30,"d":"30 "}},null,{"$f":"COUNT(CE32:CE62)","v":{"v":31,"d":"31 "}},null,{"$f":"COUNT(CG32:CG62)","v":{"v":30,"d":"30 "}},null,{"$f":"COUNT(CI32:CI62)","v":{"v":31,"d":"31 "}},null,{"$f":"COUNT(CK32:CK62)","v":{"v":31,"d":"31 "}},null,{"$f":"COUNT(CM32:CM62)","v":{"v":30,"d":"30 "}},null,{"$f":"COUNT(CO32:CO62)","v":{"v":31,"d":"31 "}},null,{"$f":"COUNT(CQ32:CQ62)","v":{"v":30,"d":"30 "}},null,{"$f":"COUNT(CS32:CS62)","v":{"v":31,"d":"31 "}},null,{"$f":"SUM(BW89:CS89)","v":{"v":365,"d":"365 "}},{"$nulls":42},{"$f":"COUNT(EL32:EL62)","v":0},null,{"$f":"COUNT(EN32:EN62)","v":0},null,{"$f":"COUNT(EP32:EP62)","v":0},null,{"$f":"COUNT(ER32:ER62)","v":0},null,{"$f":"COUNT(ET32:ET62)","v":0},null,{"$f":"COUNT(EV32:EV62)","v":0},null,{"$f":"COUNT(EX32:EX62)","v":0},null,{"$f":"COUNT(EZ32:EZ62)","v":0},null,{"$f":"COUNT(FB32:FB62)","v":0},null,{"$f":"COUNT(FD32:FD62)","v":0},null,{"$f":"COUNT(FF32:FF62)","v":0},null,{"$f":"COUNT(FH32:FH62)","v":0}]
[{"$nulls":4},{"$f":"IF(AB64<365/2,\"weniger als die Hälfte an Trockenwettertagen ! \",\" \")","v":"weniger als die Hälfte an Trockenwettertagen ! "},{"$nulls":64}," "]
[{"$nulls":4},{"$f":"AF91","v":"Das Ergebnis nach Wetterschlüssel hinterfragen. Es fehlen die Daten von mindestens einem Monat."},{"$nulls":26},{"$f":"IF(COUNTIF(AF89:AQ89,0),\"Das Ergebnis nach Wetterschlüssel hinterfragen. Es fehlen die Daten von mindestens einem Monat.\",\" \")","v":"Das Ergebnis nach Wetterschlüssel hinterfragen. Es fehlen die Daten von mindestens einem Monat."},{"$nulls":42},{"$f":"IF(BW89=0,\" \",SMALL(BW32:BW62,1))","v":{"v":1e-06,"d":"0 "}}," ",{"v":1e-06,"d":"0 "}," ",{"v":1e-06,"d":"0 "}," ",{"v":1e-06,"d":"0 "}," ",{"v":1e-06,"d":"0 "}," ",{"v":1e-06,"d":"0 "}," ",{"v":1e-06,"d":"0 "}," ",{"v":1e-06,"d":"0 "}," ",{"v":1e-06,"d":"0 "}," ",{"v":1e-06,"d":"0 "}," ",{"v":1e-06,"d":"0 "}," ",{"v":1e-06,"d":"0 "},null,{"$f":"SMALL(BW91:CS91,1)","v":1e-06},{"$nulls":42},{"$f":"IF(EL89=0,\" \",SMALL(EL32:EL62,1))","v":" "}," "," "," "," "," "," "," "," "," "," "," "," "," "," "," "," "," "," "," "," "," "," ","Kleinstwert",{"$f":"IFERROR(SMALL(EL91:FH91,1),\"\")","v":""}]
[{"$nulls":4},{"$f":"IF(AF65<48,\"Achtung, statistische Verfahren können wegen zu wenigen Daten nicht gewertet werden!\",\" \")","v":"Achtung, statistische Verfahren können wegen zu wenigen Daten nicht gewertet werden!"},{"$nulls":69},{"$f":"IF(BW89=0,\" \",LARGE(BW32:BW62,1))","v":{"v":1e-06,"d":"0 "}}," ",{"v":1e-06,"d":"0 "}," ",{"v":1e-06,"d":"0 "}," ",{"v":1e-06,"d":"0 "}," ",{"v":1e-06,"d":"0 "}," ",{"v":1e-06,"d":"0 "}," ",{"v":1e-06,"d":"0 "}," ",{"v":1e-06,"d":"0 "}," ",{"v":1e-06,"d":"0 "}," ",{"v":1e-06,"d":"0 "}," ",{"v":1e-06,"d":"0 "}," ",{"v":1e-06,"d":"0 "},null,{"$f":"LARGE(BW92:CS92,1)","v":1e-06},{"$nulls":42},{"$f":"IF(EL89=0,\" \",LARGE(EL32:EL62,1))","v":" "}," "," "," "," "," "," "," "," "," "," "," "," "," "," "," "," "," "," "," "," "," "," ","Größtwert",{"$f":"IFERROR(LARGE(EL92:FH92,1),\"\")","v":""}]
[null,"cbm bei Wetter 1-2",null,null,{"$f":"SUMIF(D32:D62,\"<=2\",E32:E62)","v":0},null,{"$f":"SUMIF(F32:F62,\"<=2\",G32:G62)","v":0},null,{"$f":"SUMIF(H32:H62,\"<=2\",I32:I62)","v":0},null,{"$f":"SUMIF(J32:J62,\"<=2\",K32:K62)","v":0},null,{"$f":"SUMIF(L$32:L$62,\"<=2\",M$32:M$62)","v":0},null,{"$f":"SUMIF(N32:N62,\"<=2\",O32:O62)","v":0},null,{"$f":"SUMIF(P32:P62,\"<=2\",Q32:Q62)","v":0},null,{"$f":"SUMIF(R32:R62,\"<=2\",S32:S62)","v":0},null,{"$f":"SUMIF(T32:T62,\"<=2\",U32:U62)","v":0},null,{"$f":"SUMIF(V32:V62,\"<=2\",W32:W62)","v":0},null,{"$f":"SUMIF(X32:X62,\"<=2\",Y32:Y62)","v":0},null,{"$f":"SUMIF(Z32:Z62,\"<=2\",AA32:AA62)","v":0},{"$f":"SUM(E93:AA93)","v":0},{"$nulls":41},{"$f":"SUM(AV88:BR88)","v":0},{"$nulls":69},"Mittelwert",null,{"$f":"IF(EL89=0,\" \",AVERAGE(EL32:EL62))","v":" "},null,{"$f":"IF(EN89=0,\" \",AVERAGE(EN32:EN62))","v":" "},null,{"$f":"IF(EP89=0,\" \",AVERAGE(EP32:EP62))","v":" "},null,{"$f":"IF(ER89=0,\" \",AVERAGE(ER32:ER62))","v":" "},null,{"$f":"IF(ET89=0,\" \",AVERAGE(ET32:ET62))","v":" "},null,{"$f":"IF(EV89=0,\" \",AVERAGE(EV32:EV62))","v":" "},null,{"$f":"IF(EX89=0,\" \",AVERAGE(EX32:EX62))","v":" "},null,{"$f":"IF(EZ89=0,\" \",AVERAGE(EZ32:EZ62))","v":" "},null,{"$f":"IF(FB89=0,\" \",AVERAGE(FB32:FB62))","v":" "},null,{"$f":"IF(FD89=0,\" \",AVERAGE(FD32:FD62))","v":" "},null,{"$f":"IF(FF89=0,\" \",AVERAGE(FF32:FF62))","v":" "},null,{"$f":"IF(FH89=0,\" \",AVERAGE(FH32:FH62))","v":" "}]
[null,"TW aller gemess. Tg.",null,null,{"$f":"IF(E64=0,0,E93/E64*E84)","v":0},null,{"$f":"IF(G64=0,0,G93/G64*G84)","v":0},null,{"$f":"IF(I64=0,0,I93/I64*I84)","v":0},null,{"$f":"IF(K64=0,0,K93/K64*K84)","v":0},null,{"$f":"IF(M64=0,0,M93/M64*M$84)","v":0},null,{"$f":"IF(O64=0,0,O93/O64*O84)","v":0},null,{"$f":"IF(Q64=0,0,Q93/Q64*Q84)","v":0},null,{"$f":"IF(S64=0,0,S93/S64*S84)","v":0},null,{"$f":"IF(U64=0,0,U93/U64*U84)","v":0},null,{"$f":"IF(W64=0,0,W93/W64*W84)","v":0},null,{"$f":"IF(Y64=0,0,Y93/Y64*Y84)","v":0},null,{"$f":"IF(AA64=0,0,AA93/AA64*AA84)","v":0},{"$f":"SUM(E94:AA94)","v":0},{"$nulls":41},{"$f":"SUM(AV89:BR89)","v":0},{"$nulls":4},{"$f":"COUNTIF(BV32:BV62,\"<=2\")","v":0},null,{"$f":"COUNTIF(BX32:BX62,\"<=2\")","v":0},null,{"$f":"COUNTIF(BZ32:BZ62,\"<=2\")","v":0},null,{"$f":"COUNTIF(CB32:CB62,\"<=2\")","v":0},null,{"$f":"COUNTIF(CD32:CD62,\"<=2\")","v":0},null,{"$f":"COUNTIF(CF32:CF62,\"<=2\")","v":0},null,{"$f":"COUNTIF(CH32:CH62,\"<=2\")","v":0},null,{"$f":"COUNTIF(CJ32:CJ62,\"<=2\")","v":0},null,{"$f":"COUNTIF(CL32:CL62,\"<=2\")","v":0},null,{"$f":"COUNTIF(CN32:CN62,\"<=2\")","v":0},null,{"$f":"COUNTIF(CP32:CP62,\"<=2\")","v":0},null,{"$f":"COUNTIF(CR32:CR62,\"<=2\")","v":0},null,{"$f":"SUM(BW94:CS94)","v":0},{"$nulls":42},{"$f":"COUNTIF(EK32:EK62,\"<=2\")","v":0},null,{"$f":"COUNTIF(EM32:EM62,\"<=2\")","v":0},null,{"$f":"COUNTIF(EO32:EO62,\"<=2\")","v":0},null,{"$f":"COUNTIF(EQ32:EQ62,\"<=2\")","v":0},null,{"$f":"COUNTIF(ES32:ES62,\"<=2\")","v":0},null,{"$f":"COUNTIF(EU32:EU62,\"<=2\")","v":0},null,{"$f":"COUNTIF(EW32:EW62,\"<=2\")","v":0},null,{"$f":"COUNTIF(EY32:EY62,\"<=2\")","v":0},null,{"$f":"COUNTIF(FA32:FA62,\"<=2\")","v":0},null,{"$f":"COUNTIF(FC32:FC62,\"<=2\")","v":0},null,{"$f":"COUNTIF(FE32:FE62,\"<=2\")","v":0},null,{"$f":"COUNTIF(FG32:FG62,\"<=2\")","v":0}]
[null,"TW / d",null,null,{"$f":"IF(E64=0,0,E93/E64)","v":0},null,{"$f":"IF(G64=0,0,G93/G64)","v":0},null,{"$f":"IF(I64=0,0,I93/I64)","v":0},null,{"$f":"IF(K64=0,0,K93/K64)","v":0},null,{"$f":"IF(M64=0,0,M93/M64)","v":0},null,{"$f":"IF(O64=0,0,O93/O64)","v":0},null,{"$f":"IF(Q64=0,0,Q93/Q64)","v":0},null,{"$f":"IF(S64=0,0,S93/S64)","v":0},null,{"$f":"IF(U64=0,0,U93/U64)","v":0},null,{"$f":"IF(W64=0,0,W93/W64)","v":0},null,{"$f":"IF(Y64=0,0,Y93/Y64)","v":0},null,{"$f":"IF(AA64=0,0,AA93/AA64)","v":0},"  ---",{"$nulls":39},"Mittelwert",null,{"$f":"IFERROR(AVERAGE(AV32:AV62,AX32:AX62,AZ32:AZ62,BB32:BB62,BD32:BD62,BF32:BF62,BH32:BH62,BJ32:BJ62,BL32:BL62,BN32:BN62,BP32:BP62,BR32:BR62),\"\")","v":""},{"$nulls":4},{"$f":"IF(BW94=0,0,BW76/BW94*BW89)","v":0},null,{"$f":"IF(BY94=0,0,BY76/BY94*BY89)","v":0},null,{"$f":"IF(CA94=0,0,CA76/CA94*CA89)","v":0},null,{"$f":"IF(CC94=0,0,CC76/CC94*CC89)","v":0},null,{"$f":"IF(CE94=0,0,CE76/CE94*CE$89)","v":0},null,{"$f":"IF(CG94=0,0,CG76/CG94*CG89)","v":0},null,{"$f":"IF(CI94=0,0,CI76/CI94*CI89)","v":0},null,{"$f":"IF(CK94=0,0,CK76/CK94*CK89)","v":0},null,{"$f":"IF(CM94=0,0,CM76/CM94*CM89)","v":0},null,{"$f":"IF(CO94=0,0,CO76/CO94*CO89)","v":0},null,{"$f":"IF(CQ94=0,0,CQ76/CQ94*CQ89)","v":0},null,{"$f":"IF(CS94=0,0,CS76/CS94*CS89)","v":0},null,{"$f":"SUM(BW95:CS95)","v":0}]
[null,"TW / Mon",{"$nulls":25},{"$f":"SUM(E67:AA67)","v":0}]
[{"$nulls":96},"  Jahresschmutzwassermenge nach Wetterschlüssel über die Monatssummen",null,{"$f":"CU78","v":0}]
[{"$nulls":26},"  Jahresschmutzwassermenge nach Wetterschlüssel über die Monatssummen",{"$f":"AB96","v":0},"cbm an TW-Tagen"]
[{"$nulls":96},"Nicht nach Wetterschlüssel über die Jahressummen !",null," "]
[{"$nulls":27}," ",{"$nulls":18}," "]
[{"$nulls":3},{"$f":"SUM(D32:D62)","v":0},{"$nulls":12},"  Bei Hochwasser und fehlender Tagesmessung wird für die Dauerlinie und das gleitendes Minimum folgender Ersatzwert eingesetzt: "]
[{"$nulls":7},"mittlerer Tageswert des Jahres :",{"$f":"BR95","v":""},null,null,"Kleinstwert:",{"$f":"AB85","v":""},null,null,"Mittelwert:",{"$f":"IFERROR((M102+I102)/2,\"\")","v":""}]
[{"$nulls":7},"größtes TW:",{"$f":"FJ92","v":""},null,null,"kleinstes TW:",{"$f":"FJ91","v":""},null,null,"mittleres TW:",{"$f":"EV23","v":{"v":1e-06,"d":"0"}}]
[{"$nulls":12},"Erstatzwert für insgesamt",{"$f":"DX18","v":365},null,"Ausfall-/ HW-Tage: ",{"$f":"'JSM Jahresdauerlinie'!E26","v":{"v":1e-06,"d":"0"}},"m³/d",null,"Dieser Wert kann auf dem Blatt \"JSM Jahresdauerlinie\" verändert werden"]
{"$rows_empty":13}
[{"$nulls":12}," "]

{"sheet":"JSM Dichtemittel ","index":11,"n_rows":49,"n_cols":18,"rows_kept":49,"merged":[[13,14,14,14],[13,15,14,15],[19,13,21,17],[20,1,21,3],[26,1,27,2],[44,1,47,3],[49,1,49,17]]}
[]
[null,{"$f":"'JSM Eingabe+TW'!B2","v":"Ergebnisse der Selbstüberwachung"},{"$nulls":14},"Berichtsjahr :",{"$f":"IF(LEN('JSM Eingabe+TW'!AB7)>0,'JSM Eingabe+TW'!AB7,\"\")","v":""}]
[]
[]
[null,{"$f":"'JSM Eingabe+TW'!B5","v":"Ermittlung der Jahresschmutzwassermenge (JSM) und des Fremdwassers (QF)"},{"$nulls":15},"Blatt 2"]
[]
[null,"Kläranlage :",{"$f":"IF(LEN('JSM Eingabe+TW'!D7)>0,'JSM Eingabe+TW'!D7,\"\")","v":""},{"$nulls":5},"VG / Stadt:  ",{"$f":"IF(LEN('JSM Eingabe+TW'!M7)>0,'JSM Eingabe+TW'!M7,\"\")","v":""},{"$nulls":7},{"$f":"'JSM Eingabe+TW'!AB2","v":"Programmversion 7.3.9"}]
[]
[null,"JSM nach dem Dichtemittel"]
[]
[]
[]
[]
[null,"Größtwert:",{"$f":"'JSM Eingabe+TW'!AB86","v":""},{"$nulls":11},"INFO","INFO- Feld mit dem Mauszeiger anfahren"]
[null,"Klassenmittel-Kleinstwert:",{"$f":"'JSM Eingabe+TW'!AB85","v":""}]
[null,"Klassenbreite:",{"$f":"IFERROR((C14-C15)/(C29^0.5),\"\")","v":""}]
[]
[]
[]
[" 1)","gewählte Klassenbreite:",{"$f":"C16","v":""},{"$nulls":10},"Achtung: wenn in der Spitze die gleiche Klassenanzahl zweimal auftritt, wird die JSM fälschlich doppelt so hoch angegeben.                                                                         In diesem Fall die Klassenbreite leicht verändern."]
[null,{"$f":"IF(M45<O45,\"Achtung, es werden nicht alle Werte berücksichtigt. Ggf. Klassenbreite ändern\",\" \")","v":" "}]
[]
[]
[" 2)","Eingangswert:",{"$f":"IFERROR(IF(C15-C20/2<0,0,C15-C20/2),\"\")","v":""}]
[null,"(von-Wert 1. Klasse)",null,null,"Klasse","von ","Klassenmittel","bis",null,"Summen","Klassenanzahl","Rang"]
[{"$nulls":4},1,{"$f":"C24","v":""},{"$f":"IFERROR((F26+H26)/2,\"\")","v":""},{"$f":"IFERROR(F26+C20,\"\")","v":""},null,{"$f":"COUNTIF('JSM Eingabe+TW'!$AF$32:$AQ$62,\"<=\"&H26)","v":0},{"$f":"J26","v":0},{"$f":"RANK(K26,$K$26:$K$46)","v":1},{"$nulls":3},"Maximalwert der Klassenanzahl",{"$f":"LARGE(K26:K46,1)","v":0}]
[null,{"$f":"IF(C24>C15,\"Achtung, Kleinstwert ist überschritten, korrigieren!\",\" \")","v":" "},null,null,2,{"$f":"IFERROR(H26+1,\"\")","v":""},{"$f":"IFERROR((F27+H27)/2,\"\")","v":""},{"$f":"IFERROR(H26+$C$20,\"\")","v":""},null,{"$f":"COUNTIF('JSM Eingabe+TW'!$AF$32:$AQ$62,\"<=\"&H27)","v":0},{"$f":"J27-J26","v":0},1,{"$nulls":3},"zug. Klassenmittel",{"$f":"SUMIF(K26:K46,Q26,G26:G46)","v":0}]
[{"$nulls":4},3,{"$f":"IFERROR(H27+1,\"\")","v":""},"",{"$f":"IFERROR(H27+$C$20,\"\")","v":""},null,{"$f":"COUNTIF('JSM Eingabe+TW'!$AF$32:$AQ$62,\"<=\"&H28)","v":0},0,1,null,"X","(X = zutreffend)","JSM",{"$f":"IFERROR(IF(M45=0,0,C30*Q27),0)","v":0},"m 3"]
[null,"auswertbare Jahrestage:",{"$f":"'JSM Eingabe+TW'!AB84","v":0},null,4,"","","",null,{"$f":"COUNTIF('JSM Eingabe+TW'!$AF$32:$AQ$62,\"<=\"&H29)","v":0},0,1,null,"(Normalfall)"]
[null,"abzurechnende Tage:",365,null,5,"","","",null,{"$f":"COUNTIF('JSM Eingabe+TW'!$AF$32:$AQ$62,\"<=\"&H30)","v":0},0,1]
[{"$nulls":4},6,"","","",null,{"$f":"COUNTIF('JSM Eingabe+TW'!$AF$32:$AQ$62,\"<=\"&H31)","v":0},0,1,null,"Wenn mehrere Spitzen zu berücksichtigen sind:"]
[{"$nulls":4},7,"","","",null,{"$f":"COUNTIF('JSM Eingabe+TW'!$AF$32:$AQ$62,\"<=\"&H32)","v":0},0,1]
[{"$nulls":4},8,"","","",null,{"$f":"COUNTIF('JSM Eingabe+TW'!$AF$32:$AQ$62,\"<=\"&H33)","v":0},0,1,null,null," - bei 2 Spitzen:"]
[{"$nulls":4},9,"","","",null,{"$f":"COUNTIF('JSM Eingabe+TW'!$AF$32:$AQ$62,\"<=\"&H34)","v":0},0,1,{"$nulls":3},"zweitgrößte Klassenanzahl",{"$f":"LARGE(K26:K46,2)","v":0}]
[{"$nulls":4},10,"","","",null,{"$f":"COUNTIF('JSM Eingabe+TW'!$AF$32:$AQ$62,\"<=\"&H35)","v":0},0,1,{"$nulls":3},"zug. Klassenmittel",{"$f":"SUMIF($K$26:$K$46,Q34,$G$26:$G$46)","v":0}]
[{"$nulls":4},11,"","","",null,{"$f":"COUNTIF('JSM Eingabe+TW'!$AF$32:$AQ$62,\"<=\"&H36)","v":0},0,1,null," ","(X = zutreffend)","JSM",{"$f":"IFERROR(($Q26*$Q27+$Q34*$Q35)/($Q26+$Q34)*C30,0)","v":0},"m 3 "]
[{"$nulls":4},12,"","","",null,{"$f":"COUNTIF('JSM Eingabe+TW'!$AF$32:$AQ$62,\"<=\"&H37)","v":0},0,1]
[{"$nulls":4},13,"","","",null,{"$f":"COUNTIF('JSM Eingabe+TW'!$AF$32:$AQ$62,\"<=\"&H38)","v":0},0,1,null,null," - bei 3 Spitzen:"]
[{"$nulls":4},14,"","","",null,{"$f":"COUNTIF('JSM Eingabe+TW'!$AF$32:$AQ$62,\"<=\"&H39)","v":0},0,1,{"$nulls":3},"drittgößte Klassenanzahl",{"$f":"LARGE($K$26:$K$46,3)","v":0}]
[{"$nulls":4},15,"","","",null,{"$f":"COUNTIF('JSM Eingabe+TW'!$AF$32:$AQ$62,\"<=\"&H40)","v":0},0,1,{"$nulls":3},"zug. Klassenmittel",{"$f":"SUMIF($K$26:$K$46,Q39,$G$26:$G$46)","v":0}]
[{"$nulls":4},16,"","","",null,{"$f":"COUNTIF('JSM Eingabe+TW'!$AF$32:$AQ$62,\"<=\"&H41)","v":0},0,1,null,null,"(X = zutreffend)","JSM",{"$f":"IFERROR(($Q$26*$Q$27+$Q$34*Q$35+Q$39*Q$40)/($Q$26+$Q$34+$Q$39)*C30,0)","v":0},"m 3 "]
[{"$nulls":4},17,"","","",null,{"$f":"COUNTIF('JSM Eingabe+TW'!$AF$32:$AQ$62,\"<=\"&H42)","v":0},0,1]
[{"$nulls":4},18,"","","",null,{"$f":"COUNTIF('JSM Eingabe+TW'!$AF$32:$AQ$62,\"<=\"&H43)","v":0},0,1]
[null,null,"erforderliche Anzahl der Klassen:",{"$f":"ROUNDUP(C29^(1/2),0)","v":0},19,"","","",null,{"$f":"COUNTIF('JSM Eingabe+TW'!$AF$32:$AQ$62,\"<=\"&H44)","v":0},0,1]
[null,{"$f":"IF(D44>20,\"Achtung, Klassenanzahl anpassen!\",IF(D44<20,\"Prüfen, ob alle Messungen in den berücksichtigten Klassen enthalten sind. Ggf. 1) oder 2) ändern. \",\"\"))","v":"Prüfen, ob alle Messungen in den berücksichtigten Klassen enthalten sind. Ggf. 1) oder 2) ändern. "},null,null,20,"","","",null,{"$f":"COUNTIF('JSM Eingabe+TW'!$AF$32:$AQ$62,\"<=\"&H45)","v":0},0,1,{"$f":"SUM(K26:K45)","v":0},"von ",{"$f":"C$29","v":0},"Messungen wurden berücksichtigt"]
[{"$nulls":4},21,"","","",null,{"$f":"COUNTIF('JSM Eingabe+TW'!$AF$32:$AQ$62,\"<=\"&H46)","v":0},{"$f":"J46-J45","v":0},1]
[{"$nulls":7},""]
[{"$nulls":12},"ERGEBNIS:",null,null,"Jahresschmutzwassermenge",{"$f":"'JSM Ergebnis'!H15","v":0},"m 3 "]
[null,"Bemerkungen:"]

{"sheet":"JSM GM A198","index":12,"n_rows":424,"n_cols":31,"rows_kept":424,"merged":[[14,1,16,1],[14,2,16,2],[14,21,15,21],[44,2,44,14],[45,2,45,14],[49,3,50,3],[49,4,50,4],[49,5,50,5],[49,9,50,9],[49,10,50,14],[51,10,51,11],[51,12,51,14]]}
[]
[null,{"$f":"'JSM Eingabe+TW'!B2","v":"Ergebnisse der Selbstüberwachung"},{"$nulls":11},"Berichtsjahr :",{"$f":"IF(LEN('JSM Eingabe+TW'!AB7)>0,'JSM Eingabe+TW'!AB7,\"\")","v":""}]
[]
[]
[null,{"$f":"'JSM Eingabe+TW'!B5","v":"Ermittlung der Jahresschmutzwassermenge (JSM) und des Fremdwassers (QF)"},{"$nulls":12},"Blatt 4"]
[]
[null,null,"Kläranlage :",{"$f":"IF(LEN('JSM Eingabe+TW'!D7)>0,'JSM Eingabe+TW'!D7,\"\")","v":""},null,null,"VG / Stadt:",{"$f":"IF(LEN('JSM Eingabe+TW'!M7)>0,'JSM Eingabe+TW'!M7,\"\")","v":""},{"$nulls":6},{"$f":"'JSM Eingabe+TW'!AB2","v":"Programmversion 7.3.9"}]
[]
[null,"JSM über das gleitende Minimum in Anlehnung an ATV-DVWK-A 198"]
[]
[]
[]
[{"$nulls":12}," "]
[{"$nulls":14},"cbm/d       "]
[null,"INFO","INFO- Feld mit dem Maus-zeiger anfahren",null,"reduzierter Trinkwasserverbrauch:",{"$f":"'JSM Eingabe+TW'!S18","v":0},"cbm/a  nach Angabe der VG / Stadt",{"$nulls":6},"mittlerer Trinkwasserverbrauch :",{"$f":"F15/365","v":0}]
[{"$nulls":13},"gemessener Kleinstwert Abwasser :",{"$f":"'JSM Eingabe+TW'!AB85","v":""}]
[{"$nulls":13},"Mittelwert (alle Daten ohne Hochwasser) :",{"$f":"'JSM Eingabe+TW'!BR95","v":""}]
[{"$nulls":13},"mittleres Trockenwetter der Trockenwetterauswertung :",{"$f":"'JSM Eingabe+TW'!EV23","v":{"v":1e-06,"d":"0 "}}]
[{"$nulls":13},{"$f":"IF('JSM Eingabe+TW'!DX18>0,\"Für fehlende Einträge und für Hochwassertage wurde jeweils folgender Ersatzwert eingesetzt :\",\" \")","v":"Für fehlende Einträge und für Hochwassertage wurde jeweils folgender Ersatzwert eingesetzt :"},{"$f":"IF('JSM Eingabe+TW'!DX18>0,'JSM Jahresdauerlinie'!E26,\" \")","v":{"v":1e-06,"d":"0 "}}]
[]
[null,"Jahresganglinie"]
[]
[]
[]
[{"$nulls":29},2,{"$f":"AD25","v":2}]
[{"$nulls":29},2,{"$f":"AD26","v":2}]
[{"$nulls":29},1,{"$f":"AD27","v":1}]
[{"$nulls":29},1,{"$f":"AD28","v":1}]
[{"$nulls":29},1,{"$f":"AD29","v":1}]
{"$rows_empty":15}
[null,null,"Die Fläche unter dem mittleren Frischwasser ist der angegebene Wasserverbrauch im Einzugsgebiet der KA"]
[null,null,"Die Fläche zwischen dem gleitenden Minimum und dem mittleren Frischwasser ist Fremdwasser"]
[null,"ERGEBNIS:"]
[null,"Qf =",{"$f":"M53","v":{"v":3.6500000000000237E-4,"d":"0 "}},"m³/a","gleitendes Minimum =",{"$f":"F53","v":{"v":3.6500000000000237E-4,"d":"0 "}},"m³/a",{"$nulls":5},"gleitendes Minimum gem. ATV-DVWK A 198 =",{"$f":"'JSM Ergebnis'!H18","v":0},"m³"]
[]
[null," im Jahr",null,"Abwasser-menge","mittleres Frischwasser","gleitendes Minimum","Erhöhung um 20%",null,null,"JSM gem. A 198","Qf = gleit. Minimum - mittl. Frischwasser",{"$nulls":5},{"$f":"IF(H52=\"X\",IF(SUMIF(M55:M419,\"<0\",M55:M419)<0,\"das bereichsweise Unterschneiden des gleitenden Minimums unter das Frischwasser-mittel wurde für die Fremdwasserermittlung unterdrückt\",\" \"),\" \")","v":" "}]
[null,{"$f":"'JSM Eingabe+TW'!AB7","v":0},{"$nulls":4},"gem. A 198"]
[{"$nulls":3},"cbm /a",{"$nulls":3}," ",null,null,"Unterschneiden wird unterdrückt",null,"Unterschneiden wird nicht unterdrückt",null,null,"x"]
[null,"Summe",null,{"$f":"SUM(D55:D419)","v":{"v":3.6500000000000237E-4,"d":"0 "}},{"$f":"SUM(E55:E419)","v":0},{"$f":"SUM(F55:F419)","v":{"v":3.6500000000000237E-4,"d":"0 "}},{"$f":"G420","v":{"v":4.3799999999999628E-4,"d":"0 "}},null,null,{"$f":"J424","v":{"v":3.6500000000000237E-4,"d":"0 "}},{"$f":"SUM(K55:K419)","v":{"v":3.6500000000000237E-4,"d":"0 "}},{"$f":"K53/F53","v":{"v":1,"d":"100%"}},{"$f":"M420","v":{"v":3.6500000000000237E-4,"d":"0 "}},null,{"$f":"M53/F53","v":{"v":1,"d":"100%"}}]
[{"$nulls":3},"Abwassermenge","mittleres Frischwasser","gleitendes Minimum   ","Schwankungsbreite nach A 198","Qt,d","max. mögl. Tagesmenge Qm, d"]
[null,"2002-01-01",1,{"$f":"'JSM Eingabe+TW'!CW32","v":{"v":1e-06,"d":"0"}},{"$f":"O15","v":0},{"$f":"F56","v":{"v":1e-06,"d":"0"}},{"$f":"F55*1.2","v":{"v":1.2e-06,"d":"0"}},{"$f":"'JSM Eingabe+TW'!K17","v":0},{"$f":"'JSM Eingabe+TW'!$K$18*3.6*24","v":0},{"$f":"IF(D55<=G55,D55,0)","v":{"v":1e-06,"d":"0"}},{"$f":"IF(F55<E55,0,F55-E55)","v":{"v":1e-06,"d":"0"}},{"$f":"IF(M55<0,1, \" \")","v":" "},{"$f":"F55-E55","v":{"v":1e-06,"d":"0"}}]
[null,"2002-01-02",2,{"$f":"'JSM Eingabe+TW'!CW33","v":{"v":1e-06,"d":"0"}},{"$f":"$E$55","v":0},{"v":1e-06,"d":"0"},{"$f":"F56*1.2","v":{"v":1.2e-06,"d":"0"}},{"$f":"H55","v":0},{"$f":"'JSM Eingabe+TW'!$K$18*3.6*24","v":0},{"v":1e-06,"d":"0"},{"v":1e-06,"d":"0"}," ",{"v":1e-06,"d":"0"}]
[null,"2002-01-03",3,{"$f":"'JSM Eingabe+TW'!CW34","v":{"v":1e-06,"d":"0"}},0,{"$f":"F58","v":{"v":1e-06,"d":"0"}},{"v":1.2e-06,"d":"0"},{"$f":"H56","v":0},{"$f":"'JSM Eingabe+TW'!$K$18*3.6*24","v":0},{"v":1e-06,"d":"0"},{"v":1e-06,"d":"0"}," ",{"v":1e-06,"d":"0"}]
[null,"2002-01-04",4,{"$f":"'JSM Eingabe+TW'!CW35","v":{"v":1e-06,"d":"0"}},0,{"v":1e-06,"d":"0"},{"v":1.2e-06,"d":"0"},0,{"$f":"'JSM Eingabe+TW'!$K$18*3.6*24","v":0},{"v":1e-06,"d":"0"},{"v":1e-06,"d":"0"}," ",{"v":1e-06,"d":"0"}]
[null,"2002-01-05",5,{"$f":"'JSM Eingabe+TW'!CW36","v":{"v":1e-06,"d":"0"}},0,{"v":1e-06,"d":"0"},{"v":1.2e-06,"d":"0"},0,{"$f":"'JSM Eingabe+TW'!$K$18*3.6*24","v":0},{"v":1e-06,"d":"0"},{"v":1e-06,"d":"0"}," ",{"v":1e-06,"d":"0"}]
[null,"2002-01-06",6,{"$f":"'JSM Eingabe+TW'!CW37","v":{"v":1e-06,"d":"0"}},0,{"v":1e-06,"d":"0"},{"v":1.2e-06,"d":"0"},0,{"$f":"'JSM Eingabe+TW'!$K$18*3.6*24","v":0},{"v":1e-06,"d":"0"},{"v":1e-06,"d":"0"}," ",{"v":1e-06,"d":"0"}]
[null,"2002-01-07",7,{"$f":"'JSM Eingabe+TW'!CW38","v":{"v":1e-06,"d":"0"}},0,{"v":1e-06,"d":"0"},{"v":1.2e-06,"d":"0"},0,{"$f":"'JSM Eingabe+TW'!$K$18*3.6*24","v":0},{"v":1e-06,"d":"0"},{"v":1e-06,"d":"0"}," ",{"v":1e-06,"d":"0"}]
[null,"2002-01-08",8,{"$f":"'JSM Eingabe+TW'!CW39","v":{"v":1e-06,"d":"0"}},0,{"v":1e-06,"d":"0"},{"v":1.2e-06,"d":"0"},0,{"$f":"'JSM Eingabe+TW'!$K$18*3.6*24","v":0},{"v":1e-06,"d":"0"},{"v":1e-06,"d":"0"}," ",{"v":1e-06,"d":"0"}]
[null,"2002-01-09",9,{"$f":"'JSM Eingabe+TW'!CW40","v":{"v":1e-06,"d":"0"}},0,{"v":1e-06,"d":"0"},{"v":1.2e-06,"d":"0"},0,{"$f":"'JSM Eingabe+TW'!$K$18*3.6*24","v":0},{"v":1e-06,"d":"0"},{"v":1e-06,"d":"0"}," ",{"v":1e-06,"d":"0"}]
[null,"2002-01-10",10,{"$f":"'JSM Eingabe+TW'!CW41","v":{"v":1e-06,"d":"0"}},0,{"v":1e-06,"d":"0"},{"v":1.2e-06,"d":"0"},0,{"$f":"'JSM Eingabe+TW'!$K$18*3.6*24","v":0},{"v":1e-06,"d":"0"},{"v":1e-06,"d":"0"}," ",{"v":1e-06,"d":"0"}]
[null,"2002-01-11",11,{"$f":"'JSM Eingabe+TW'!CW42","v":{"v":1e-06,"d":"0"}},0,{"$f":"SMALL(D55:D75,1)","v":{"v":1e-06,"d":"0.00"}},{"v":1.2e-06,"d":"0"},0,{"$f":"'JSM Eingabe+TW'!$K$18*3.6*24","v":0},{"v":1e-06,"d":"0"},{"v":1e-06,"d":"0"}," ",{"v":1e-06,"d":"0"}]
[null,"2002-01-12",12,{"$f":"'JSM Eingabe+TW'!CW43","v":{"v":1e-06,"d":"0"}},0,{"$f":"SMALL(D56:D76,1)","v":{"v":1e-06,"d":"0.00"}},{"v":1.2e-06,"d":"0"},0,{"$f":"'JSM Eingabe+TW'!$K$18*3.6*24","v":0},{"v":1e-06,"d":"0"},{"v":1e-06,"d":"0"}," ",{"v":1e-06,"d":"0"}]
[null,"2002-01-13",13,{"$f":"'JSM Eingabe+TW'!CW44","v":{"v":1e-06,"d":"0"}},0,{"v":1e-06,"d":"0.00"},{"v":1.2e-06,"d":"0"},0,{"$f":"'JSM Eingabe+TW'!$K$18*3.6*24","v":0},{"v":1e-06,"d":"0"},{"v":1e-06,"d":"0"}," ",{"v":1e-06,"d":"0"}]
[null,"2002-01-14",14,{"$f":"'JSM Eingabe+TW'!CW45","v":{"v":1e-06,"d":"0"}},0,{"v":1e-06,"d":"0.00"},{"v":1.2e-06,"d":"0"},0,{"$f":"'JSM Eingabe+TW'!$K$18*3.6*24","v":0},{"v":1e-06,"d":"0"},{"v":1e-06,"d":"0"}," ",{"v":1e-06,"d":"0"}]
[null,"2002-01-15",15,{"$f":"'JSM Eingabe+TW'!CW46","v":{"v":1e-06,"d":"0"}},0,{"v":1e-06,"d":"0.00"},{"v":1.2e-06,"d":"0"},0,{"$f":"'JSM Eingabe+TW'!$K$18*3.6*24","v":0},{"v":1e-06,"d":"0"},{"v":1e-06,"d":"0"}," ",{"v":1e-06,"d":"0"}]
[null,"2002-01-16",16,{"$f":"'JSM Eingabe+TW'!CW47","v":{"v":1e-06,"d":"0"}},0,{"v":1e-06,"d":"0.00"},{"v":1.2e-06,"d":"0"},0,{"$f":"'JSM Eingabe+TW'!$K$18*3.6*24","v":0},{"v":1e-06,"d":"0"},{"v":1e-06,"d":"0"}," ",{"v":1e-06,"d":"0"}]
[null,"2002-01-17",17,{"$f":"'JSM Eingabe+TW'!CW48","v":{"v":1e-06,"d":"0"}},0,{"v":1e-06,"d":"0.00"},{"v":1.2e-06,"d":"0"},0,{"$f":"'JSM Eingabe+TW'!$K$18*3.6*24","v":0},{"v":1e-06,"d":"0"},{"v":1e-06,"d":"0"}," ",{"v":1e-06,"d":"0"}]
[null,"2002-01-18",18,{"$f":"'JSM Eingabe+TW'!CW49","v":{"v":1e-06,"d":"0"}},0,{"v":1e-06,"d":"0.00"},{"v":1.2e-06,"d":"0"},0,{"$f":"'JSM Eingabe+TW'!$K$18*3.6*24","v":0},{"v":1e-06,"d":"0"},{"v":1e-06,"d":"0"}," ",{"v":1e-06,"d":"0"}]
[null,"2002-01-19",19,{"$f":"'JSM Eingabe+TW'!CW50","v":{"v":1e-06,"d":"0"}},0,{"v":1e-06,"d":"0.00"},{"v":1.2e-06,"d":"0"},0,{"$f":"'JSM Eingabe+TW'!$K$18*3.6*24","v":0},{"v":1e-06,"d":"0"},{"v":1e-06,"d":"0"}," ",{"v":1e-06,"d":"0"}]
[null,"2002-01-20",20,{"$f":"'JSM Eingabe+TW'!CW51","v":{"v":1e-06,"d":"0"}},0,{"v":1e-06,"d":"0.00"},{"v":1.2e-06,"d":"0"},0,{"$f":"'JSM Eingabe+TW'!$K$18*3.6*24","v":0},{"v":1e-06,"d":"0"},{"v":1e-06,"d":"0"}," ",{"v":1e-06,"d":"0"}]
[null,"2002-01-21",21,{"$f":"'JSM Eingabe+TW'!CW52","v":{"v":1e-06,"d":"0"}},0,{"v":1e-06,"d":"0.00"},{"v":1.2e-06,"d":"0"},0,{"$f":"'JSM Eingabe+TW'!$K$18*3.6*24","v":0},{"v":1e-06,"d":"0"},{"v":1e-06,"d":"0"}," ",{"v":1e-06,"d":"0"}]
[null,"2002-01-22",22,{"$f":"'JSM Eingabe+TW'!CW53","v":{"v":1e-06,"d":"0"}},0,{"v":1e-06,"d":"0.00"},{"v":1.2e-06,"d":"0"},0,{"$f":"'JSM Eingabe+TW'!$K$18*3.6*24","v":0},{"v":1e-06,"d":"0"},{"v":1e-06,"d":"0"}," ",{"v":1e-06,"d":"0"}]
[null,"2002-01-23",23,{"$f":"'JSM Eingabe+TW'!CW54","v":{"v":1e-06,"d":"0"}},0,{"v":1e-06,"d":"0.00"},{"v":1.2e-06,"d":"0"},0,{"$f":"'JSM Eingabe+TW'!$K$18*3.6*24","v":0},{"v":1e-06,"d":"0"},{"v":1e-06,"d":"0"}," ",{"v":1e-06,"d":"0"}]
[null,"2002-01-24",24,{"$f":"'JSM Eingabe+TW'!CW55","v":{"v":1e-06,"d":"0"}},0,{"v":1e-06,"d":"0.00"},{"v":1.2e-06,"d":"0"},0,{"$f":"'JSM Eingabe+TW'!$K$18*3.6*24","v":0},{"v":1e-06,"d":"0"},{"v":1e-06,"d":"0"}," ",{"v":1e-06,"d":"0"}]
[null,"2002-01-25",25,{"$f":"'JSM Eingabe+TW'!CW56","v":{"v":1e-06,"d":"0"}},0,{"v":1e-06,"d":"0.00"},{"v":1.2e-06,"d":"0"},0,{"$f":"'JSM Eingabe+TW'!$K$18*3.6*24","v":0},{"v":1e-06,"d":"0"},{"v":1e-06,"d":"0"}," ",{"v":1e-06,"d":"0"}]
[null,"2002-01-26",26,{"$f":"'JSM Eingabe+TW'!CW57","v":{"v":1e-06,"d":"0"}},0,{"v":1e-06,"d":"0.00"},{"v":1.2e-06,"d":"0"},0,{"$f":"'JSM Eingabe+TW'!$K$18*3.6*24","v":0},{"v":1e-06,"d":"0"},{"v":1e-06,"d":"0"}," ",{"v":1e-06,"d":"0"}]
[null,"2002-01-27",27,{"$f":"'JSM Eingabe+TW'!CW58","v":{"v":1e-06,"d":"0"}},0,{"v":1e-06,"d":"0.00"},{"v":1.2e-06,"d":"0"},0,{"$f":"'JSM Eingabe+TW'!$K$18*3.6*24","v":0},{"v":1e-06,"d":"0"},{"v":1e-06,"d":"0"}," ",{"v":1e-06,"d":"0"}]
[null,"2002-01-28",28,{"$f":"'JSM Eingabe+TW'!CW59","v":{"v":1e-06,"d":"0"}},0,{"v":1e-06,"d":"0.00"},{"v":1.2e-06,"d":"0"},0,{"$f":"'JSM Eingabe+TW'!$K$18*3.6*24","v":0},{"v":1e-06,"d":"0"},{"v":1e-06,"d":"0"}," ",{"v":1e-06,"d":"0"}]
[null,"2002-01-29",29,{"$f":"'JSM Eingabe+TW'!CW60","v":{"v":1e-06,"d":"0"}},0,{"v":1e-06,"d":"0.00"},{"v":1.2e-06,"d":"0"},0,{"$f":"'JSM Eingabe+TW'!$K$18*3.6*24","v":0},{"v":1e-06,"d":"0"},{"v":1e-06,"d":"0"}," ",{"v":1e-06,"d":"0"}]
[null,"2002-01-30",30,{"$f":"'JSM Eingabe+TW'!CW61","v":{"v":1e-06,"d":"0"}},0,{"v":1e-06,"d":"0.00"},{"v":1.2e-06,"d":"0"},0,{"$f":"'JSM Eingabe+TW'!$K$18*3.6*24","v":0},{"v":1e-06,"d":"0"},{"v":1e-06,"d":"0"}," ",{"v":1e-06,"d":"0"}]
[null,"2002-01-31",31,{"$f":"'JSM Eingabe+TW'!CW62","v":{"v":1e-06,"d":"0"}},0,{"v":1e-06,"d":"0.00"},{"v":1.2e-06,"d":"0"},0,{"$f":"'JSM Eingabe+TW'!$K$18*3.6*24","v":0},{"v":1e-06,"d":"0"},{"v":1e-06,"d":"0"}," ",{"v":1e-06,"d":"0"}]
[null,"2002-02-01",32,{"$f":"'JSM Eingabe+TW'!CX32","v":{"v":1e-06,"d":"0"}},0,{"v":1e-06,"d":"0.00"},{"v":1.2e-06,"d":"0"},0,{"$f":"'JSM Eingabe+TW'!$K$18*3.6*24","v":0},{"v":1e-06,"d":"0"},{"v":1e-06,"d":"0"}," ",{"v":1e-06,"d":"0"}]
[null,"2002-02-02",33,{"$f":"'JSM Eingabe+TW'!CX33","v":{"v":1e-06,"d":"0"}},0,{"v":1e-06,"d":"0.00"},{"v":1.2e-06,"d":"0"},0,{"$f":"'JSM Eingabe+TW'!$K$18*3.6*24","v":0},{"v":1e-06,"d":"0"},{"v":1e-06,"d":"0"}," ",{"v":1e-06,"d":"0"}]
[null,"2002-02-03",34,{"$f":"'JSM Eingabe+TW'!CX34","v":{"v":1e-06,"d":"0"}},0,{"v":1e-06,"d":"0.00"},{"v":1.2e-06,"d":"0"},0,{"$f":"'JSM Eingabe+TW'!$K$18*3.6*24","v":0},{"v":1e-06,"d":"0"},{"v":1e-06,"d":"0"}," ",{"v":1e-06,"d":"0"}]
[null,"2002-02-04",35,{"$f":"'JSM Eingabe+TW'!CX35","v":{"v":1e-06,"d":"0"}},0,{"v":1e-06,"d":"0.00"},{"v":1.2e-06,"d":"0"},0,{"$f":"'JSM Eingabe+TW'!$K$18*3.6*24","v":0},{"v":1e-06,"d":"0"},{"v":1e-06,"d":"0"}," ",{"v":1e-06,"d":"0"}]
[null,"2002-02-05",36,{"$f":"'JSM Eingabe+TW'!CX36","v":{"v":1e-06,"d":"0"}},0,{"v":1e-06,"d":"0.00"},{"v":1.2e-06,"d":"0"},0,{"$f":"'JSM Eingabe+TW'!$K$18*3.6*24","v":0},{"v":1e-06,"d":"0"},{"v":1e-06,"d":"0"}," ",{"v":1e-06,"d":"0"}]
[null,"2002-02-06",37,{"$f":"'JSM Eingabe+TW'!CX37","v":{"v":1e-06,"d":"0"}},0,{"v":1e-06,"d":"0.00"},{"v":1.2e-06,"d":"0"},0,{"$f":"'JSM Eingabe+TW'!$K$18*3.6*24","v":0},{"v":1e-06,"d":"0"},{"v":1e-06,"d":"0"}," ",{"v":1e-06,"d":"0"}]
[null,"2002-02-07",38,{"$f":"'JSM Eingabe+TW'!CX38","v":{"v":1e-06,"d":"0"}},0,{"v":1e-06,"d":"0.00"},{"v":1.2e-06,"d":"0"},0,{"$f":"'JSM Eingabe+TW'!$K$18*3.6*24","v":0},{"v":1e-06,"d":"0"},{"v":1e-06,"d":"0"}," ",{"v":1e-06,"d":"0"}]
[null,"2002-02-08",39,{"$f":"'JSM Eingabe+TW'!CX39","v":{"v":1e-06,"d":"0"}},0,{"v":1e-06,"d":"0.00"},{"v":1.2e-06,"d":"0"},0,{"$f":"'JSM Eingabe+TW'!$K$18*3.6*24","v":0},{"v":1e-06,"d":"0"},{"v":1e-06,"d":"0"}," ",{"v":1e-06,"d":"0"}]
[null,"2002-02-09",40,{"$f":"'JSM Eingabe+TW'!CX40","v":{"v":1e-06,"d":"0"}},0,{"v":1e-06,"d":"0.00"},{"v":1.2e-06,"d":"0"},0,{"$f":"'JSM Eingabe+TW'!$K$18*3.6*24","v":0},{"v":1e-06,"d":"0"},{"v":1e-06,"d":"0"}," ",{"v":1e-06,"d":"0"}]
[null,"2002-02-10",41,{"$f":"'JSM Eingabe+TW'!CX41","v":{"v":1e-06,"d":"0"}},0,{"v":1e-06,"d":"0.00"},{"v":1.2e-06,"d":"0"},0,{"$f":"'JSM Eingabe+TW'!$K$18*3.6*24","v":0},{"v":1e-06,"d":"0"},{"v":1e-06,"d":"0"}," ",{"v":1e-06,"d":"0"}]
[null,"2002-02-11",42,{"$f":"'JSM Eingabe+TW'!CX42","v":{"v":1e-06,"d":"0"}},0,{"v":1e-06,"d":"0.00"},{"v":1.2e-06,"d":"0"},0,{"$f":"'JSM Eingabe+TW'!$K$18*3.6*24","v":0},{"v":1e-06,"d":"0"},{"v":1e-06,"d":"0"}," ",{"v":1e-06,"d":"0"}]
[null,"2002-02-12",43,{"$f":"'JSM Eingabe+TW'!CX43","v":{"v":1e-06,"d":"0"}},0,{"v":1e-06,"d":"0.00"},{"v":1.2e-06,"d":"0"},0,{"$f":"'JSM Eingabe+TW'!$K$18*3.6*24","v":0},{"v":1e-06,"d":"0"},{"v":1e-06,"d":"0"}," ",{"v":1e-06,"d":"0"}]
[null,"2002-02-13",44,{"$f":"'JSM Eingabe+TW'!CX44","v":{"v":1e-06,"d":"0"}},0,{"v":1e-06,"d":"0.00"},{"v":1.2e-06,"d":"0"},0,{"$f":"'JSM Eingabe+TW'!$K$18*3.6*24","v":0},{"v":1e-06,"d":"0"},{"v":1e-06,"d":"0"}," ",{"v":1e-06,"d":"0"}]
[null,"2002-02-14",45,{"$f":"'JSM Eingabe+TW'!CX45","v":{"v":1e-06,"d":"0"}},0,{"v":1e-06,"d":"0.00"},{"v":1.2e-06,"d":"0"},0,{"$f":"'JSM Eingabe+TW'!$K$18*3.6*24","v":0},{"v":1e-06,"d":"0"},{"v":1e-06,"d":"0"}," ",{"v":1e-06,"d":"0"}]
[null,"2002-02-15",46,{"$f":"'JSM Eingabe+TW'!CX46","v":{"v":1e-06,"d":"0"}},0,{"v":1e-06,"d":"0.00"},{"v":1.2e-06,"d":"0"},0,{"$f":"'JSM Eingabe+TW'!$K$18*3.6*24","v":0},{"v":1e-06,"d":"0"},{"v":1e-06,"d":"0"}," ",{"v":1e-06,"d":"0"}]
[null,"2002-02-16",47,{"$f":"'JSM Eingabe+TW'!CX47","v":{"v":1e-06,"d":"0"}},0,{"v":1e-06,"d":"0.00"},{"v":1.2e-06,"d":"0"},0,{"$f":"'JSM Eingabe+TW'!$K$18*3.6*24","v":0},{"v":1e-06,"d":"0"},{"v":1e-06,"d":"0"}," ",{"v":1e-06,"d":"0"}]
[null,"2002-02-17",48,{"$f":"'JSM Eingabe+TW'!CX48","v":{"v":1e-06,"d":"0"}},0,{"v":1e-06,"d":"0.00"},{"v":1.2e-06,"d":"0"},0,{"$f":"'JSM Eingabe+TW'!$K$18*3.6*24","v":0},{"v":1e-06,"d":"0"},{"v":1e-06,"d":"0"}," ",{"v":1e-06,"d":"0"}]
[null,"2002-02-18",49,{"$f":"'JSM Eingabe+TW'!CX49","v":{"v":1e-06,"d":"0"}},0,{"v":1e-06,"d":"0.00"},{"v":1.2e-06,"d":"0"},0,{"$f":"'JSM Eingabe+TW'!$K$18*3.6*24","v":0},{"v":1e-06,"d":"0"},{"v":1e-06,"d":"0"}," ",{"v":1e-06,"d":"0"}]
[null,"2002-02-19",50,{"$f":"'JSM Eingabe+TW'!CX50","v":{"v":1e-06,"d":"0"}},0,{"v":1e-06,"d":"0.00"},{"v":1.2e-06,"d":"0"},0,{"$f":"'JSM Eingabe+TW'!$K$18*3.6*24","v":0},{"v":1e-06,"d":"0"},{"v":1e-06,"d":"0"}," ",{"v":1e-06,"d":"0"}]
[null,"2002-02-20",51,{"$f":"'JSM Eingabe+TW'!CX51","v":{"v":1e-06,"d":"0"}},0,{"v":1e-06,"d":"0.00"},{"v":1.2e-06,"d":"0"},0,{"$f":"'JSM Eingabe+TW'!$K$18*3.6*24","v":0},{"v":1e-06,"d":"0"},{"v":1e-06,"d":"0"}," ",{"v":1e-06,"d":"0"}]
[null,"2002-02-21",52,{"$f":"'JSM Eingabe+TW'!CX52","v":{"v":1e-06,"d":"0"}},0,{"v":1e-06,"d":"0.00"},{"v":1.2e-06,"d":"0"},0,{"$f":"'JSM Eingabe+TW'!$K$18*3.6*24","v":0},{"v":1e-06,"d":"0"},{"v":1e-06,"d":"0"}," ",{"v":1e-06,"d":"0"}]
[null,"2002-02-22",53,{"$f":"'JSM Eingabe+TW'!CX53","v":{"v":1e-06,"d":"0"}},0,{"v":1e-06,"d":"0.00"},{"v":1.2e-06,"d":"0"},0,{"$f":"'JSM Eingabe+TW'!$K$18*3.6*24","v":0},{"v":1e-06,"d":"0"},{"v":1e-06,"d":"0"}," ",{"v":1e-06,"d":"0"}]
[null,"2002-02-23",54,{"$f":"'JSM Eingabe+TW'!CX54","v":{"v":1e-06,"d":"0"}},0,{"v":1e-06,"d":"0.00"},{"v":1.2e-06,"d":"0"},0,{"$f":"'JSM Eingabe+TW'!$K$18*3.6*24","v":0},{"v":1e-06,"d":"0"},{"v":1e-06,"d":"0"}," ",{"v":1e-06,"d":"0"}]
[null,"2002-02-24",55,{"$f":"'JSM Eingabe+TW'!CX55","v":{"v":1e-06,"d":"0"}},0,{"v":1e-06,"d":"0.00"},{"v":1.2e-06,"d":"0"},0,{"$f":"'JSM Eingabe+TW'!$K$18*3.6*24","v":0},{"v":1e-06,"d":"0"},{"v":1e-06,"d":"0"}," ",{"v":1e-06,"d":"0"}]
[null,"2002-02-25",56,{"$f":"'JSM Eingabe+TW'!CX56","v":{"v":1e-06,"d":"0"}},0,{"v":1e-06,"d":"0.00"},{"v":1.2e-06,"d":"0"},0,{"$f":"'JSM Eingabe+TW'!$K$18*3.6*24","v":0},{"v":1e-06,"d":"0"},{"v":1e-06,"d":"0"}," ",{"v":1e-06,"d":"0"}]
[null,"2002-02-26",57,{"$f":"'JSM Eingabe+TW'!CX57","v":{"v":1e-06,"d":"0"}},0,{"v":1e-06,"d":"0.00"},{"v":1.2e-06,"d":"0"},0,{"$f":"'JSM Eingabe+TW'!$K$18*3.6*24","v":0},{"v":1e-06,"d":"0"},{"v":1e-06,"d":"0"}," ",{"v":1e-06,"d":"0"}]
[null,"2002-02-27",58,{"$f":"'JSM Eingabe+TW'!CX58","v":{"v":1e-06,"d":"0"}},0,{"v":1e-06,"d":"0.00"},{"v":1.2e-06,"d":"0"},0,{"$f":"'JSM Eingabe+TW'!$K$18*3.6*24","v":0},{"v":1e-06,"d":"0"},{"v":1e-06,"d":"0"}," ",{"v":1e-06,"d":"0"}]
[null,"2002-02-28",59,{"$f":"'JSM Eingabe+TW'!CX59","v":{"v":1e-06,"d":"0"}},0,{"v":1e-06,"d":"0.00"},{"v":1.2e-06,"d":"0"},0,{"$f":"'JSM Eingabe+TW'!$K$18*3.6*24","v":0},{"v":1e-06,"d":"0"},{"v":1e-06,"d":"0"}," ",{"v":1e-06,"d":"0"}]
[null,"2002-03-01",60,{"$f":"'JSM Eingabe+TW'!CY32","v":{"v":1e-06,"d":"0"}},0,{"v":1e-06,"d":"0.00"},{"v":1.2e-06,"d":"0"},0,{"$f":"'JSM Eingabe+TW'!$K$18*3.6*24","v":0},{"v":1e-06,"d":"0"},{"v":1e-06,"d":"0"}," ",{"v":1e-06,"d":"0"}]
[null,"2002-03-02",61,{"$f":"'JSM Eingabe+TW'!CY33","v":{"v":1e-06,"d":"0"}},0,{"v":1e-06,"d":"0.00"},{"v":1.2e-06,"d":"0"},0,{"$f":"'JSM Eingabe+TW'!$K$18*3.6*24","v":0},{"v":1e-06,"d":"0"},{"v":1e-06,"d":"0"}," ",{"v":1e-06,"d":"0"}]
[null,"2002-03-03",62,{"$f":"'JSM Eingabe+TW'!CY34","v":{"v":1e-06,"d":"0"}},0,{"v":1e-06,"d":"0.00"},{"v":1.2e-06,"d":"0"},0,{"$f":"'JSM Eingabe+TW'!$K$18*3.6*24","v":0},{"v":1e-06,"d":"0"},{"v":1e-06,"d":"0"}," ",{"v":1e-06,"d":"0"}]
[null,"2002-03-04",63,{"$f":"'JSM Eingabe+TW'!CY35","v":{"v":1e-06,"d":"0"}},0,{"v":1e-06,"d":"0.00"},{"v":1.2e-06,"d":"0"},0,{"$f":"'JSM Eingabe+TW'!$K$18*3.6*24","v":0},{"v":1e-06,"d":"0"},{"v":1e-06,"d":"0"}," ",{"v":1e-06,"d":"0"}]
[null,"2002-03-05",64,{"$f":"'JSM Eingabe+TW'!CY36","v":{"v":1e-06,"d":"0"}},0,{"v":1e-06,"d":"0.00"},{"v":1.2e-06,"d":"0"},0,{"$f":"'JSM Eingabe+TW'!$K$18*3.6*24","v":0},{"v":1e-06,"d":"0"},{"v":1e-06,"d":"0"}," ",{"v":1e-06,"d":"0"}]
[null,"2002-03-06",65,{"$f":"'JSM Eingabe+TW'!CY37","v":{"v":1e-06,"d":"0"}},0,{"v":1e-06,"d":"0.00"},{"v":1.2e-06,"d":"0"},0,{"$f":"'JSM Eingabe+TW'!$K$18*3.6*24","v":0},{"$f":"IF(D119<=G119,D119,0)","v":{"v":1e-06,"d":"0"}},{"$f":"IF(F119<E119,0,F119-E119)","v":{"v":1e-06,"d":"0"}},{"$f":"IF(M119<0,1, \" \")","v":" "},{"$f":"F119-E119","v":{"v":1e-06,"d":"0"}}]
[null,"2002-03-07",66,{"$f":"'JSM Eingabe+TW'!CY38","v":{"v":1e-06,"d":"0"}},{"$f":"$E$55","v":0},{"v":1e-06,"d":"0.00"},{"$f":"F120*1.2","v":{"v":1.2e-06,"d":"0"}},0,{"$f":"'JSM Eingabe+TW'!$K$18*3.6*24","v":0},{"v":1e-06,"d":"0"},{"v":1e-06,"d":"0"}," ",{"v":1e-06,"d":"0"}]
[null,"2002-03-08",67,{"$f":"'JSM Eingabe+TW'!CY39","v":{"v":1e-06,"d":"0"}},0,{"v":1e-06,"d":"0.00"},{"v":1.2e-06,"d":"0"},{"$f":"H120","v":0},{"$f":"'JSM Eingabe+TW'!$K$18*3.6*24","v":0},{"v":1e-06,"d":"0"},{"v":1e-06,"d":"0"}," ",{"v":1e-06,"d":"0"}]
[null,"2002-03-09",68,{"$f":"'JSM Eingabe+TW'!CY40","v":{"v":1e-06,"d":"0"}},0,{"v":1e-06,"d":"0.00"},{"v":1.2e-06,"d":"0"},0,{"$f":"'JSM Eingabe+TW'!$K$18*3.6*24","v":0},{"v":1e-06,"d":"0"},{"v":1e-06,"d":"0"}," ",{"v":1e-06,"d":"0"}]
[null,"2002-03-10",69,{"$f":"'JSM Eingabe+TW'!CY41","v":{"v":1e-06,"d":"0"}},0,{"v":1e-06,"d":"0.00"},{"v":1.2e-06,"d":"0"},0,{"$f":"'JSM Eingabe+TW'!$K$18*3.6*24","v":0},{"v":1e-06,"d":"0"},{"v":1e-06,"d":"0"}," ",{"v":1e-06,"d":"0"}]
[null,"2002-03-11",70,{"$f":"'JSM Eingabe+TW'!CY42","v":{"v":1e-06,"d":"0"}},0,{"v":1e-06,"d":"0.00"},{"v":1.2e-06,"d":"0"},0,{"$f":"'JSM Eingabe+TW'!$K$18*3.6*24","v":0},{"v":1e-06,"d":"0"},{"v":1e-06,"d":"0"}," ",{"v":1e-06,"d":"0"}]
[null,"2002-03-12",71,{"$f":"'JSM Eingabe+TW'!CY43","v":{"v":1e-06,"d":"0"}},0,{"v":1e-06,"d":"0.00"},{"v":1.2e-06,"d":"0"},0,{"$f":"'JSM Eingabe+TW'!$K$18*3.6*24","v":0},{"v":1e-06,"d":"0"},{"v":1e-06,"d":"0"}," ",{"v":1e-06,"d":"0"}]
[null,"2002-03-13",72,{"$f":"'JSM Eingabe+TW'!CY44","v":{"v":1e-06,"d":"0"}},0,{"v":1e-06,"d":"0.00"},{"v":1.2e-06,"d":"0"},0,{"$f":"'JSM Eingabe+TW'!$K$18*3.6*24","v":0},{"v":1e-06,"d":"0"},{"v":1e-06,"d":"0"}," ",{"v":1e-06,"d":"0"}]
[null,"2002-03-14",73,{"$f":"'JSM Eingabe+TW'!CY45","v":{"v":1e-06,"d":"0"}},0,{"v":1e-06,"d":"0.00"},{"v":1.2e-06,"d":"0"},0,{"$f":"'JSM Eingabe+TW'!$K$18*3.6*24","v":0},{"v":1e-06,"d":"0"},{"v":1e-06,"d":"0"}," ",{"v":1e-06,"d":"0"}]
[null,"2002-03-15",74,{"$f":"'JSM Eingabe+TW'!CY46","v":{"v":1e-06,"d":"0"}},0,{"v":1e-06,"d":"0.00"},{"v":1.2e-06,"d":"0"},0,{"$f":"'JSM Eingabe+TW'!$K$18*3.6*24","v":0},{"v":1e-06,"d":"0"},{"v":1e-06,"d":"0"}," ",{"v":1e-06,"d":"0"}]
[null,"2002-03-16",75,{"$f":"'JSM Eingabe+TW'!CY47","v":{"v":1e-06,"d":"0"}},0,{"v":1e-06,"d":"0.00"},{"v":1.2e-06,"d":"0"},0,{"$f":"'JSM Eingabe+TW'!$K$18*3.6*24","v":0},{"v":1e-06,"d":"0"},{"v":1e-06,"d":"0"}," ",{"v":1e-06,"d":"0"}]
[null,"2002-03-17",76,{"$f":"'JSM Eingabe+TW'!CY48","v":{"v":1e-06,"d":"0"}},0,{"$f":"SMALL(D120:D140,1)","v":{"v":1e-06,"d":"0.00"}},{"v":1.2e-06,"d":"0"},0,{"$f":"'JSM Eingabe+TW'!$K$18*3.6*24","v":0},{"v":1e-06,"d":"0"},{"v":1e-06,"d":"0"}," ",{"v":1e-06,"d":"0"}]
[null,"2002-03-18",77,{"$f":"'JSM Eingabe+TW'!CY49","v":{"v":1e-06,"d":"0"}},0,{"v":1e-06,"d":"0.00"},{"v":1.2e-06,"d":"0"},0,{"$f":"'JSM Eingabe+TW'!$K$18*3.6*24","v":0},{"v":1e-06,"d":"0"},{"v":1e-06,"d":"0"}," ",{"v":1e-06,"d":"0"}]
[null,"2002-03-19",78,{"$f":"'JSM Eingabe+TW'!CY50","v":{"v":1e-06,"d":"0"}},0,{"v":1e-06,"d":"0.00"},{"v":1.2e-06,"d":"0"},0,{"$f":"'JSM Eingabe+TW'!$K$18*3.6*24","v":0},{"v":1e-06,"d":"0"},{"v":1e-06,"d":"0"}," ",{"v":1e-06,"d":"0"}]
[null,"2002-03-20",79,{"$f":"'JSM Eingabe+TW'!CY51","v":{"v":1e-06,"d":"0"}},0,{"v":1e-06,"d":"0.00"},{"v":1.2e-06,"d":"0"},0,{"$f":"'JSM Eingabe+TW'!$K$18*3.6*24","v":0},{"v":1e-06,"d":"0"},{"v":1e-06,"d":"0"}," ",{"v":1e-06,"d":"0"}]
[null,"2002-03-21",80,{"$f":"'JSM Eingabe+TW'!CY52","v":{"v":1e-06,"d":"0"}},0,{"v":1e-06,"d":"0.00"},{"v":1.2e-06,"d":"0"},0,{"$f":"'JSM Eingabe+TW'!$K$18*3.6*24","v":0},{"v":1e-06,"d":"0"},{"v":1e-06,"d":"0"}," ",{"v":1e-06,"d":"0"}]
[null,"2002-03-22",81,{"$f":"'JSM Eingabe+TW'!CY53","v":{"v":1e-06,"d":"0"}},0,{"v":1e-06,"d":"0.00"},{"v":1.2e-06,"d":"0"},0,{"$f":"'JSM Eingabe+TW'!$K$18*3.6*24","v":0},{"v":1e-06,"d":"0"},{"v":1e-06,"d":"0"}," ",{"v":1e-06,"d":"0"}]
[null,"2002-03-23",82,{"$f":"'JSM Eingabe+TW'!CY54","v":{"v":1e-06,"d":"0"}},0,{"v":1e-06,"d":"0.00"},{"v":1.2e-06,"d":"0"},0,{"$f":"'JSM Eingabe+TW'!$K$18*3.6*24","v":0},{"v":1e-06,"d":"0"},{"v":1e-06,"d":"0"}," ",{"v":1e-06,"d":"0"}]
[null,"2002-03-24",83,{"$f":"'JSM Eingabe+TW'!CY55","v":{"v":1e-06,"d":"0"}},0,{"v":1e-06,"d":"0.00"},{"v":1.2e-06,"d":"0"},0,{"$f":"'JSM Eingabe+TW'!$K$18*3.6*24","v":0},{"v":1e-06,"d":"0"},{"v":1e-06,"d":"0"}," ",{"v":1e-06,"d":"0"}]
[null,"2002-03-25",84,{"$f":"'JSM Eingabe+TW'!CY56","v":{"v":1e-06,"d":"0"}},0,{"v":1e-06,"d":"0.00"},{"v":1.2e-06,"d":"0"},0,{"$f":"'JSM Eingabe+TW'!$K$18*3.6*24","v":0},{"v":1e-06,"d":"0"},{"v":1e-06,"d":"0"}," ",{"v":1e-06,"d":"0"}]
[null,"2002-03-26",85,{"$f":"'JSM Eingabe+TW'!CY57","v":{"v":1e-06,"d":"0"}},0,{"v":1e-06,"d":"0.00"},{"v":1.2e-06,"d":"0"},0,{"$f":"'JSM Eingabe+TW'!$K$18*3.6*24","v":0},{"v":1e-06,"d":"0"},{"v":1e-06,"d":"0"}," ",{"v":1e-06,"d":"0"}]
[null,"2002-03-27",86,{"$f":"'JSM Eingabe+TW'!CY58","v":{"v":1e-06,"d":"0"}},0,{"v":1e-06,"d":"0.00"},{"v":1.2e-06,"d":"0"},0,{"$f":"'JSM Eingabe+TW'!$K$18*3.6*24","v":0},{"v":1e-06,"d":"0"},{"v":1e-06,"d":"0"}," ",{"v":1e-06,"d":"0"}]
[null,"2002-03-28",87,{"$f":"'JSM Eingabe+TW'!CY59","v":{"v":1e-06,"d":"0"}},0,{"v":1e-06,"d":"0.00"},{"v":1.2e-06,"d":"0"},0,{"$f":"'JSM Eingabe+TW'!$K$18*3.6*24","v":0},{"v":1e-06,"d":"0"},{"v":1e-06,"d":"0"}," ",{"v":1e-06,"d":"0"}]
[null,"2002-03-29",88,{"$f":"'JSM Eingabe+TW'!CY60","v":{"v":1e-06,"d":"0"}},0,{"v":1e-06,"d":"0.00"},{"v":1.2e-06,"d":"0"},0,{"$f":"'JSM Eingabe+TW'!$K$18*3.6*24","v":0},{"v":1e-06,"d":"0"},{"v":1e-06,"d":"0"}," ",{"v":1e-06,"d":"0"}]
[null,"2002-03-30",89,{"$f":"'JSM Eingabe+TW'!CY61","v":{"v":1e-06,"d":"0"}},0,{"v":1e-06,"d":"0.00"},{"v":1.2e-06,"d":"0"},0,{"$f":"'JSM Eingabe+TW'!$K$18*3.6*24","v":0},{"v":1e-06,"d":"0"},{"v":1e-06,"d":"0"}," ",{"v":1e-06,"d":"0"}]
[null,"2002-03-31",90,{"$f":"'JSM Eingabe+TW'!CY62","v":{"v":1e-06,"d":"0"}},0,{"v":1e-06,"d":"0.00"},{"v":1.2e-06,"d":"0"},0,{"$f":"'JSM Eingabe+TW'!$K$18*3.6*24","v":0},{"v":1e-06,"d":"0"},{"v":1e-06,"d":"0"}," ",{"v":1e-06,"d":"0"}]
[null,"2002-04-01",91,{"$f":"'JSM Eingabe+TW'!CZ32","v":{"v":1e-06,"d":"0"}},0,{"v":1e-06,"d":"0.00"},{"v":1.2e-06,"d":"0"},0,{"$f":"'JSM Eingabe+TW'!$K$18*3.6*24","v":0},{"v":1e-06,"d":"0"},{"v":1e-06,"d":"0"}," ",{"v":1e-06,"d":"0"}]
[null,"2002-04-02",92,{"$f":"'JSM Eingabe+TW'!CZ33","v":{"v":1e-06,"d":"0"}},0,{"v":1e-06,"d":"0.00"},{"v":1.2e-06,"d":"0"},0,{"$f":"'JSM Eingabe+TW'!$K$18*3.6*24","v":0},{"v":1e-06,"d":"0"},{"v":1e-06,"d":"0"}," ",{"v":1e-06,"d":"0"}]
[null,"2002-04-03",93,{"$f":"'JSM Eingabe+TW'!CZ34","v":{"v":1e-06,"d":"0"}},0,{"v":1e-06,"d":"0.00"},{"v":1.2e-06,"d":"0"},0,{"$f":"'JSM Eingabe+TW'!$K$18*3.6*24","v":0},{"v":1e-06,"d":"0"},{"v":1e-06,"d":"0"}," ",{"v":1e-06,"d":"0"}]
[null,"2002-04-04",94,{"$f":"'JSM Eingabe+TW'!CZ35","v":{"v":1e-06,"d":"0"}},0,{"v":1e-06,"d":"0.00"},{"v":1.2e-06,"d":"0"},0,{"$f":"'JSM Eingabe+TW'!$K$18*3.6*24","v":0},{"v":1e-06,"d":"0"},{"v":1e-06,"d":"0"}," ",{"v":1e-06,"d":"0"}]
[null,"2002-04-05",95,{"$f":"'JSM Eingabe+TW'!CZ36","v":{"v":1e-06,"d":"0"}},0,{"v":1e-06,"d":"0.00"},{"v":1.2e-06,"d":"0"},0,{"$f":"'JSM Eingabe+TW'!$K$18*3.6*24","v":0},{"v":1e-06,"d":"0"},{"v":1e-06,"d":"0"}," ",{"v":1e-06,"d":"0"}]
[null,"2002-04-06",96,{"$f":"'JSM Eingabe+TW'!CZ37","v":{"v":1e-06,"d":"0"}},0,{"v":1e-06,"d":"0.00"},{"v":1.2e-06,"d":"0"},0,{"$f":"'JSM Eingabe+TW'!$K$18*3.6*24","v":0},{"v":1e-06,"d":"0"},{"v":1e-06,"d":"0"}," ",{"v":1e-06,"d":"0"}]
[null,"2002-04-07",97,{"$f":"'JSM Eingabe+TW'!CZ38","v":{"v":1e-06,"d":"0"}},0,{"v":1e-06,"d":"0.00"},{"v":1.2e-06,"d":"0"},0,{"$f":"'JSM Eingabe+TW'!$K$18*3.6*24","v":0},{"v":1e-06,"d":"0"},{"v":1e-06,"d":"0"}," ",{"v":1e-06,"d":"0"}]
[null,"2002-04-08",98,{"$f":"'JSM Eingabe+TW'!CZ39","v":{"v":1e-06,"d":"0"}},0,{"v":1e-06,"d":"0.00"},{"v":1.2e-06,"d":"0"},0,{"$f":"'JSM Eingabe+TW'!$K$18*3.6*24","v":0},{"v":1e-06,"d":"0"},{"v":1e-06,"d":"0"}," ",{"v":1e-06,"d":"0"}]
[null,"2002-04-09",99,{"$f":"'JSM Eingabe+TW'!CZ40","v":{"v":1e-06,"d":"0"}},0,{"v":1e-06,"d":"0.00"},{"v":1.2e-06,"d":"0"},0,{"$f":"'JSM Eingabe+TW'!$K$18*3.6*24","v":0},{"v":1e-06,"d":"0"},{"v":1e-06,"d":"0"}," ",{"v":1e-06,"d":"0"}]
[null,"2002-04-10",100,{"$f":"'JSM Eingabe+TW'!CZ41","v":{"v":1e-06,"d":"0"}},0,{"v":1e-06,"d":"0.00"},{"v":1.2e-06,"d":"0"},0,{"$f":"'JSM Eingabe+TW'!$K$18*3.6*24","v":0},{"v":1e-06,"d":"0"},{"v":1e-06,"d":"0"}," ",{"v":1e-06,"d":"0"}]
[null,"2002-04-11",101,{"$f":"'JSM Eingabe+TW'!CZ42","v":{"v":1e-06,"d":"0"}},0,{"v":1e-06,"d":"0.00"},{"v":1.2e-06,"d":"0"},0,{"$f":"'JSM Eingabe+TW'!$K$18*3.6*24","v":0},{"v":1e-06,"d":"0"},{"v":1e-06,"d":"0"}," ",{"v":1e-06,"d":"0"}]
[null,"2002-04-12",102,{"$f":"'JSM Eingabe+TW'!CZ43","v":{"v":1e-06,"d":"0"}},0,{"v":1e-06,"d":"0.00"},{"v":1.2e-06,"d":"0"},0,{"$f":"'JSM Eingabe+TW'!$K$18*3.6*24","v":0},{"v":1e-06,"d":"0"},{"v":1e-06,"d":"0"}," ",{"v":1e-06,"d":"0"}]
[null,"2002-04-13",103,{"$f":"'JSM Eingabe+TW'!CZ44","v":{"v":1e-06,"d":"0"}},0,{"v":1e-06,"d":"0.00"},{"v":1.2e-06,"d":"0"},0,{"$f":"'JSM Eingabe+TW'!$K$18*3.6*24","v":0},{"v":1e-06,"d":"0"},{"v":1e-06,"d":"0"}," ",{"v":1e-06,"d":"0"}]
[null,"2002-04-14",104,{"$f":"'JSM Eingabe+TW'!CZ45","v":{"v":1e-06,"d":"0"}},0,{"v":1e-06,"d":"0.00"},{"v":1.2e-06,"d":"0"},0,{"$f":"'JSM Eingabe+TW'!$K$18*3.6*24","v":0},{"v":1e-06,"d":"0"},{"v":1e-06,"d":"0"}," ",{"v":1e-06,"d":"0"}]
[null,"2002-04-15",105,{"$f":"'JSM Eingabe+TW'!CZ46","v":{"v":1e-06,"d":"0"}},0,{"v":1e-06,"d":"0.00"},{"v":1.2e-06,"d":"0"},0,{"$f":"'JSM Eingabe+TW'!$K$18*3.6*24","v":0},{"v":1e-06,"d":"0"},{"v":1e-06,"d":"0"}," ",{"v":1e-06,"d":"0"}]
[null,"2002-04-16",106,{"$f":"'JSM Eingabe+TW'!CZ47","v":{"v":1e-06,"d":"0"}},0,{"v":1e-06,"d":"0.00"},{"v":1.2e-06,"d":"0"},0,{"$f":"'JSM Eingabe+TW'!$K$18*3.6*24","v":0},{"v":1e-06,"d":"0"},{"v":1e-06,"d":"0"}," ",{"v":1e-06,"d":"0"}]
[null,"2002-04-17",107,{"$f":"'JSM Eingabe+TW'!CZ48","v":{"v":1e-06,"d":"0"}},0,{"v":1e-06,"d":"0.00"},{"v":1.2e-06,"d":"0"},0,{"$f":"'JSM Eingabe+TW'!$K$18*3.6*24","v":0},{"v":1e-06,"d":"0"},{"v":1e-06,"d":"0"}," ",{"v":1e-06,"d":"0"}]
[null,"2002-04-18",108,{"$f":"'JSM Eingabe+TW'!CZ49","v":{"v":1e-06,"d":"0"}},0,{"v":1e-06,"d":"0.00"},{"v":1.2e-06,"d":"0"},0,{"$f":"'JSM Eingabe+TW'!$K$18*3.6*24","v":0},{"v":1e-06,"d":"0"},{"v":1e-06,"d":"0"}," ",{"v":1e-06,"d":"0"}]
[null,"2002-04-19",109,{"$f":"'JSM Eingabe+TW'!CZ50","v":{"v":1e-06,"d":"0"}},0,{"v":1e-06,"d":"0.00"},{"v":1.2e-06,"d":"0"},0,{"$f":"'JSM Eingabe+TW'!$K$18*3.6*24","v":0},{"v":1e-06,"d":"0"},{"v":1e-06,"d":"0"}," ",{"v":1e-06,"d":"0"}]
[null,"2002-04-20",110,{"$f":"'JSM Eingabe+TW'!CZ51","v":{"v":1e-06,"d":"0"}},0,{"v":1e-06,"d":"0.00"},{"v":1.2e-06,"d":"0"},0,{"$f":"'JSM Eingabe+TW'!$K$18*3.6*24","v":0},{"v":1e-06,"d":"0"},{"v":1e-06,"d":"0"}," ",{"v":1e-06,"d":"0"}]
[null,"2002-04-21",111,{"$f":"'JSM Eingabe+TW'!CZ52","v":{"v":1e-06,"d":"0"}},0,{"v":1e-06,"d":"0.00"},{"v":1.2e-06,"d":"0"},0,{"$f":"'JSM Eingabe+TW'!$K$18*3.6*24","v":0},{"v":1e-06,"d":"0"},{"v":1e-06,"d":"0"}," ",{"v":1e-06,"d":"0"}]
[null,"2002-04-22",112,{"$f":"'JSM Eingabe+TW'!CZ53","v":{"v":1e-06,"d":"0"}},0,{"v":1e-06,"d":"0.00"},{"v":1.2e-06,"d":"0"},0,{"$f":"'JSM Eingabe+TW'!$K$18*3.6*24","v":0},{"v":1e-06,"d":"0"},{"v":1e-06,"d":"0"}," ",{"v":1e-06,"d":"0"}]
[null,"2002-04-23",113,{"$f":"'JSM Eingabe+TW'!CZ54","v":{"v":1e-06,"d":"0"}},0,{"v":1e-06,"d":"0.00"},{"v":1.2e-06,"d":"0"},0,{"$f":"'JSM Eingabe+TW'!$K$18*3.6*24","v":0},{"v":1e-06,"d":"0"},{"v":1e-06,"d":"0"}," ",{"v":1e-06,"d":"0"}]
[null,"2002-04-24",114,{"$f":"'JSM Eingabe+TW'!CZ55","v":{"v":1e-06,"d":"0"}},0,{"v":1e-06,"d":"0.00"},{"v":1.2e-06,"d":"0"},0,{"$f":"'JSM Eingabe+TW'!$K$18*3.6*24","v":0},{"v":1e-06,"d":"0"},{"v":1e-06,"d":"0"}," ",{"v":1e-06,"d":"0"}]
[null,"2002-04-25",115,{"$f":"'JSM Eingabe+TW'!CZ56","v":{"v":1e-06,"d":"0"}},0,{"v":1e-06,"d":"0.00"},{"v":1.2e-06,"d":"0"},0,{"$f":"'JSM Eingabe+TW'!$K$18*3.6*24","v":0},{"v":1e-06,"d":"0"},{"v":1e-06,"d":"0"}," ",{"v":1e-06,"d":"0"}]
[null,"2002-04-26",116,{"$f":"'JSM Eingabe+TW'!CZ57","v":{"v":1e-06,"d":"0"}},0,{"v":1e-06,"d":"0.00"},{"v":1.2e-06,"d":"0"},0,{"$f":"'JSM Eingabe+TW'!$K$18*3.6*24","v":0},{"v":1e-06,"d":"0"},{"v":1e-06,"d":"0"}," ",{"v":1e-06,"d":"0"}]
[null,"2002-04-27",117,{"$f":"'JSM Eingabe+TW'!CZ58","v":{"v":1e-06,"d":"0"}},0,{"v":1e-06,"d":"0.00"},{"v":1.2e-06,"d":"0"},0,{"$f":"'JSM Eingabe+TW'!$K$18*3.6*24","v":0},{"v":1e-06,"d":"0"},{"v":1e-06,"d":"0"}," ",{"v":1e-06,"d":"0"}]
[null,"2002-04-28",118,{"$f":"'JSM Eingabe+TW'!CZ59","v":{"v":1e-06,"d":"0"}},0,{"v":1e-06,"d":"0.00"},{"v":1.2e-06,"d":"0"},0,{"$f":"'JSM Eingabe+TW'!$K$18*3.6*24","v":0},{"v":1e-06,"d":"0"},{"v":1e-06,"d":"0"}," ",{"v":1e-06,"d":"0"}]
[null,"2002-04-29",119,{"$f":"'JSM Eingabe+TW'!CZ60","v":{"v":1e-06,"d":"0"}},0,{"v":1e-06,"d":"0.00"},{"v":1.2e-06,"d":"0"},0,{"$f":"'JSM Eingabe+TW'!$K$18*3.6*24","v":0},{"v":1e-06,"d":"0"},{"v":1e-06,"d":"0"}," ",{"v":1e-06,"d":"0"}]
[null,"2002-04-30",120,{"$f":"'JSM Eingabe+TW'!CZ61","v":{"v":1e-06,"d":"0"}},0,{"v":1e-06,"d":"0.00"},{"v":1.2e-06,"d":"0"},0,{"$f":"'JSM Eingabe+TW'!$K$18*3.6*24","v":0},{"v":1e-06,"d":"0"},{"v":1e-06,"d":"0"}," ",{"v":1e-06,"d":"0"}]
[null,"2002-05-01",121,{"$f":"'JSM Eingabe+TW'!DA32","v":{"v":1e-06,"d":"0"}},0,{"v":1e-06,"d":"0.00"},{"v":1.2e-06,"d":"0"},0,{"$f":"'JSM Eingabe+TW'!$K$18*3.6*24","v":0},{"v":1e-06,"d":"0"},{"v":1e-06,"d":"0"}," ",{"v":1e-06,"d":"0"}]
[null,"2002-05-02",122,{"$f":"'JSM Eingabe+TW'!DA33","v":{"v":1e-06,"d":"0"}},0,{"v":1e-06,"d":"0.00"},{"v":1.2e-06,"d":"0"},0,{"$f":"'JSM Eingabe+TW'!$K$18*3.6*24","v":0},{"v":1e-06,"d":"0"},{"v":1e-06,"d":"0"}," ",{"v":1e-06,"d":"0"}]
[null,"2002-05-03",123,{"$f":"'JSM Eingabe+TW'!DA34","v":{"v":1e-06,"d":"0"}},0,{"v":1e-06,"d":"0.00"},{"v":1.2e-06,"d":"0"},0,{"$f":"'JSM Eingabe+TW'!$K$18*3.6*24","v":0},{"v":1e-06,"d":"0"},{"v":1e-06,"d":"0"}," ",{"v":1e-06,"d":"0"}]
[null,"2002-05-04",124,{"$f":"'JSM Eingabe+TW'!DA35","v":{"v":1e-06,"d":"0"}},0,{"v":1e-06,"d":"0.00"},{"v":1.2e-06,"d":"0"},0,{"$f":"'JSM Eingabe+TW'!$K$18*3.6*24","v":0},{"v":1e-06,"d":"0"},{"v":1e-06,"d":"0"}," ",{"v":1e-06,"d":"0"}]
[null,"2002-05-05",125,{"$f":"'JSM Eingabe+TW'!DA36","v":{"v":1e-06,"d":"0"}},0,{"v":1e-06,"d":"0.00"},{"v":1.2e-06,"d":"0"},0,{"$f":"'JSM Eingabe+TW'!$K$18*3.6*24","v":0},{"v":1e-06,"d":"0"},{"v":1e-06,"d":"0"}," ",{"v":1e-06,"d":"0"}]
[null,"2002-05-06",126,{"$f":"'JSM Eingabe+TW'!DA37","v":{"v":1e-06,"d":"0"}},0,{"v":1e-06,"d":"0.00"},{"v":1.2e-06,"d":"0"},0,{"$f":"'JSM Eingabe+TW'!$K$18*3.6*24","v":0},{"v":1e-06,"d":"0"},{"v":1e-06,"d":"0"}," ",{"v":1e-06,"d":"0"}]
[null,"2002-05-07",127,{"$f":"'JSM Eingabe+TW'!DA38","v":{"v":1e-06,"d":"0"}},0,{"v":1e-06,"d":"0.00"},{"v":1.2e-06,"d":"0"},0,{"$f":"'JSM Eingabe+TW'!$K$18*3.6*24","v":0},{"v":1e-06,"d":"0"},{"v":1e-06,"d":"0"}," ",{"v":1e-06,"d":"0"}]
[null,"2002-05-08",128,{"$f":"'JSM Eingabe+TW'!DA39","v":{"v":1e-06,"d":"0"}},0,{"v":1e-06,"d":"0.00"},{"v":1.2e-06,"d":"0"},0,{"$f":"'JSM Eingabe+TW'!$K$18*3.6*24","v":0},{"v":1e-06,"d":"0"},{"v":1e-06,"d":"0"}," ",{"v":1e-06,"d":"0"}]
[null,"2002-05-09",129,{"$f":"'JSM Eingabe+TW'!DA40","v":{"v":1e-06,"d":"0"}},0,{"v":1e-06,"d":"0.00"},{"v":1.2e-06,"d":"0"},0,{"$f":"'JSM Eingabe+TW'!$K$18*3.6*24","v":0},{"$f":"IF(D183<=G183,D183,0)","v":{"v":1e-06,"d":"0"}},{"$f":"IF(F183<E183,0,F183-E183)","v":{"v":1e-06,"d":"0"}},{"$f":"IF(M183<0,1, \" \")","v":" "},{"$f":"F183-E183","v":{"v":1e-06,"d":"0"}}]
[null,"2002-05-10",130,{"$f":"'JSM Eingabe+TW'!DA41","v":{"v":1e-06,"d":"0"}},{"$f":"$E$55","v":0},{"v":1e-06,"d":"0.00"},{"$f":"F184*1.2","v":{"v":1.2e-06,"d":"0"}},0,{"$f":"'JSM Eingabe+TW'!$K$18*3.6*24","v":0},{"v":1e-06,"d":"0"},{"v":1e-06,"d":"0"}," ",{"v":1e-06,"d":"0"}]
[null,"2002-05-11",131,{"$f":"'JSM Eingabe+TW'!DA42","v":{"v":1e-06,"d":"0"}},0,{"v":1e-06,"d":"0.00"},{"v":1.2e-06,"d":"0"},{"$f":"H184","v":0},{"$f":"'JSM Eingabe+TW'!$K$18*3.6*24","v":0},{"v":1e-06,"d":"0"},{"v":1e-06,"d":"0"}," ",{"v":1e-06,"d":"0"}]
[null,"2002-05-12",132,{"$f":"'JSM Eingabe+TW'!DA43","v":{"v":1e-06,"d":"0"}},0,{"v":1e-06,"d":"0.00"},{"v":1.2e-06,"d":"0"},0,{"$f":"'JSM Eingabe+TW'!$K$18*3.6*24","v":0},{"v":1e-06,"d":"0"},{"v":1e-06,"d":"0"}," ",{"v":1e-06,"d":"0"}]
[null,"2002-05-13",133,{"$f":"'JSM Eingabe+TW'!DA44","v":{"v":1e-06,"d":"0"}},0,{"v":1e-06,"d":"0.00"},{"v":1.2e-06,"d":"0"},0,{"$f":"'JSM Eingabe+TW'!$K$18*3.6*24","v":0},{"v":1e-06,"d":"0"},{"v":1e-06,"d":"0"}," ",{"v":1e-06,"d":"0"}]
[null,"2002-05-14",134,{"$f":"'JSM Eingabe+TW'!DA45","v":{"v":1e-06,"d":"0"}},0,{"v":1e-06,"d":"0.00"},{"v":1.2e-06,"d":"0"},0,{"$f":"'JSM Eingabe+TW'!$K$18*3.6*24","v":0},{"v":1e-06,"d":"0"},{"v":1e-06,"d":"0"}," ",{"v":1e-06,"d":"0"}]
[null,"2002-05-15",135,{"$f":"'JSM Eingabe+TW'!DA46","v":{"v":1e-06,"d":"0"}},0,{"v":1e-06,"d":"0.00"},{"v":1.2e-06,"d":"0"},0,{"$f":"'JSM Eingabe+TW'!$K$18*3.6*24","v":0},{"v":1e-06,"d":"0"},{"v":1e-06,"d":"0"}," ",{"v":1e-06,"d":"0"}]
[null,"2002-05-16",136,{"$f":"'JSM Eingabe+TW'!DA47","v":{"v":1e-06,"d":"0"}},0,{"v":1e-06,"d":"0.00"},{"v":1.2e-06,"d":"0"},0,{"$f":"'JSM Eingabe+TW'!$K$18*3.6*24","v":0},{"v":1e-06,"d":"0"},{"v":1e-06,"d":"0"}," ",{"v":1e-06,"d":"0"}]
[null,"2002-05-17",137,{"$f":"'JSM Eingabe+TW'!DA48","v":{"v":1e-06,"d":"0"}},0,{"v":1e-06,"d":"0.00"},{"v":1.2e-06,"d":"0"},0,{"$f":"'JSM Eingabe+TW'!$K$18*3.6*24","v":0},{"v":1e-06,"d":"0"},{"v":1e-06,"d":"0"}," ",{"v":1e-06,"d":"0"}]
[null,"2002-05-18",138,{"$f":"'JSM Eingabe+TW'!DA49","v":{"v":1e-06,"d":"0"}},0,{"v":1e-06,"d":"0.00"},{"v":1.2e-06,"d":"0"},0,{"$f":"'JSM Eingabe+TW'!$K$18*3.6*24","v":0},{"v":1e-06,"d":"0"},{"v":1e-06,"d":"0"}," ",{"v":1e-06,"d":"0"}]
[null,"2002-05-19",139,{"$f":"'JSM Eingabe+TW'!DA50","v":{"v":1e-06,"d":"0"}},0,{"v":1e-06,"d":"0.00"},{"v":1.2e-06,"d":"0"},0,{"$f":"'JSM Eingabe+TW'!$K$18*3.6*24","v":0},{"v":1e-06,"d":"0"},{"v":1e-06,"d":"0"}," ",{"v":1e-06,"d":"0"}]
[null,"2002-05-20",140,{"$f":"'JSM Eingabe+TW'!DA51","v":{"v":1e-06,"d":"0"}},0,{"$f":"SMALL(D184:D204,1)","v":{"v":1e-06,"d":"0.00"}},{"v":1.2e-06,"d":"0"},0,{"$f":"'JSM Eingabe+TW'!$K$18*3.6*24","v":0},{"v":1e-06,"d":"0"},{"v":1e-06,"d":"0"}," ",{"v":1e-06,"d":"0"}]
[null,"2002-05-21",141,{"$f":"'JSM Eingabe+TW'!DA52","v":{"v":1e-06,"d":"0"}},0,{"v":1e-06,"d":"0.00"},{"v":1.2e-06,"d":"0"},0,{"$f":"'JSM Eingabe+TW'!$K$18*3.6*24","v":0},{"v":1e-06,"d":"0"},{"v":1e-06,"d":"0"}," ",{"v":1e-06,"d":"0"}]
[null,"2002-05-22",142,{"$f":"'JSM Eingabe+TW'!DA53","v":{"v":1e-06,"d":"0"}},0,{"v":1e-06,"d":"0.00"},{"v":1.2e-06,"d":"0"},0,{"$f":"'JSM Eingabe+TW'!$K$18*3.6*24","v":0},{"v":1e-06,"d":"0"},{"v":1e-06,"d":"0"}," ",{"v":1e-06,"d":"0"}]
[null,"2002-05-23",143,{"$f":"'JSM Eingabe+TW'!DA54","v":{"v":1e-06,"d":"0"}},0,{"v":1e-06,"d":"0.00"},{"v":1.2e-06,"d":"0"},0,{"$f":"'JSM Eingabe+TW'!$K$18*3.6*24","v":0},{"v":1e-06,"d":"0"},{"v":1e-06,"d":"0"}," ",{"v":1e-06,"d":"0"}]
[null,"2002-05-24",144,{"$f":"'JSM Eingabe+TW'!DA55","v":{"v":1e-06,"d":"0"}},0,{"v":1e-06,"d":"0.00"},{"v":1.2e-06,"d":"0"},0,{"$f":"'JSM Eingabe+TW'!$K$18*3.6*24","v":0},{"v":1e-06,"d":"0"},{"v":1e-06,"d":"0"}," ",{"v":1e-06,"d":"0"}]
[null,"2002-05-25",145,{"$f":"'JSM Eingabe+TW'!DA56","v":{"v":1e-06,"d":"0"}},0,{"v":1e-06,"d":"0.00"},{"v":1.2e-06,"d":"0"},0,{"$f":"'JSM Eingabe+TW'!$K$18*3.6*24","v":0},{"v":1e-06,"d":"0"},{"v":1e-06,"d":"0"}," ",{"v":1e-06,"d":"0"}]
[null,"2002-05-26",146,{"$f":"'JSM Eingabe+TW'!DA57","v":{"v":1e-06,"d":"0"}},0,{"v":1e-06,"d":"0.00"},{"v":1.2e-06,"d":"0"},0,{"$f":"'JSM Eingabe+TW'!$K$18*3.6*24","v":0},{"v":1e-06,"d":"0"},{"v":1e-06,"d":"0"}," ",{"v":1e-06,"d":"0"}]
[null,"2002-05-27",147,{"$f":"'JSM Eingabe+TW'!DA58","v":{"v":1e-06,"d":"0"}},0,{"v":1e-06,"d":"0.00"},{"v":1.2e-06,"d":"0"},0,{"$f":"'JSM Eingabe+TW'!$K$18*3.6*24","v":0},{"v":1e-06,"d":"0"},{"v":1e-06,"d":"0"}," ",{"v":1e-06,"d":"0"}]
[null,"2002-05-28",148,{"$f":"'JSM Eingabe+TW'!DA59","v":{"v":1e-06,"d":"0"}},0,{"v":1e-06,"d":"0.00"},{"v":1.2e-06,"d":"0"},0,{"$f":"'JSM Eingabe+TW'!$K$18*3.6*24","v":0},{"v":1e-06,"d":"0"},{"v":1e-06,"d":"0"}," ",{"v":1e-06,"d":"0"}]
[null,"2002-05-29",149,{"$f":"'JSM Eingabe+TW'!DA60","v":{"v":1e-06,"d":"0"}},0,{"v":1e-06,"d":"0.00"},{"v":1.2e-06,"d":"0"},0,{"$f":"'JSM Eingabe+TW'!$K$18*3.6*24","v":0},{"v":1e-06,"d":"0"},{"v":1e-06,"d":"0"}," ",{"v":1e-06,"d":"0"}]
[null,"2002-05-30",150,{"$f":"'JSM Eingabe+TW'!DA61","v":{"v":1e-06,"d":"0"}},0,{"v":1e-06,"d":"0.00"},{"v":1.2e-06,"d":"0"},0,{"$f":"'JSM Eingabe+TW'!$K$18*3.6*24","v":0},{"v":1e-06,"d":"0"},{"v":1e-06,"d":"0"}," ",{"v":1e-06,"d":"0"}]
[null,"2002-05-31",151,{"$f":"'JSM Eingabe+TW'!DA62","v":{"v":1e-06,"d":"0"}},0,{"v":1e-06,"d":"0.00"},{"v":1.2e-06,"d":"0"},0,{"$f":"'JSM Eingabe+TW'!$K$18*3.6*24","v":0},{"v":1e-06,"d":"0"},{"v":1e-06,"d":"0"}," ",{"v":1e-06,"d":"0"}]
[null,"2002-06-01",152,{"$f":"'JSM Eingabe+TW'!DB32","v":{"v":1e-06,"d":"0"}},0,{"v":1e-06,"d":"0.00"},{"v":1.2e-06,"d":"0"},0,{"$f":"'JSM Eingabe+TW'!$K$18*3.6*24","v":0},{"v":1e-06,"d":"0"},{"v":1e-06,"d":"0"}," ",{"v":1e-06,"d":"0"}]
[null,"2002-06-02",153,{"$f":"'JSM Eingabe+TW'!DB33","v":{"v":1e-06,"d":"0"}},0,{"v":1e-06,"d":"0.00"},{"v":1.2e-06,"d":"0"},0,{"$f":"'JSM Eingabe+TW'!$K$18*3.6*24","v":0},{"v":1e-06,"d":"0"},{"v":1e-06,"d":"0"}," ",{"v":1e-06,"d":"0"}]
[null,"2002-06-03",154,{"$f":"'JSM Eingabe+TW'!DB34","v":{"v":1e-06,"d":"0"}},0,{"v":1e-06,"d":"0.00"},{"v":1.2e-06,"d":"0"},0,{"$f":"'JSM Eingabe+TW'!$K$18*3.6*24","v":0},{"v":1e-06,"d":"0"},{"v":1e-06,"d":"0"}," ",{"v":1e-06,"d":"0"}]
[null,"2002-06-04",155,{"$f":"'JSM Eingabe+TW'!DB35","v":{"v":1e-06,"d":"0"}},0,{"v":1e-06,"d":"0.00"},{"v":1.2e-06,"d":"0"},0,{"$f":"'JSM Eingabe+TW'!$K$18*3.6*24","v":0},{"v":1e-06,"d":"0"},{"v":1e-06,"d":"0"}," ",{"v":1e-06,"d":"0"}]
[null,"2002-06-05",156,{"$f":"'JSM Eingabe+TW'!DB36","v":{"v":1e-06,"d":"0"}},0,{"v":1e-06,"d":"0.00"},{"v":1.2e-06,"d":"0"},0,{"$f":"'JSM Eingabe+TW'!$K$18*3.6*24","v":0},{"v":1e-06,"d":"0"},{"v":1e-06,"d":"0"}," ",{"v":1e-06,"d":"0"}]
[null,"2002-06-06",157,{"$f":"'JSM Eingabe+TW'!DB37","v":{"v":1e-06,"d":"0"}},0,{"v":1e-06,"d":"0.00"},{"v":1.2e-06,"d":"0"},0,{"$f":"'JSM Eingabe+TW'!$K$18*3.6*24","v":0},{"v":1e-06,"d":"0"},{"v":1e-06,"d":"0"}," ",{"v":1e-06,"d":"0"}]
[null,"2002-06-07",158,{"$f":"'JSM Eingabe+TW'!DB38","v":{"v":1e-06,"d":"0"}},0,{"v":1e-06,"d":"0.00"},{"v":1.2e-06,"d":"0"},0,{"$f":"'JSM Eingabe+TW'!$K$18*3.6*24","v":0},{"v":1e-06,"d":"0"},{"v":1e-06,"d":"0"}," ",{"v":1e-06,"d":"0"}]
[null,"2002-06-08",159,{"$f":"'JSM Eingabe+TW'!DB39","v":{"v":1e-06,"d":"0"}},0,{"v":1e-06,"d":"0.00"},{"v":1.2e-06,"d":"0"},0,{"$f":"'JSM Eingabe+TW'!$K$18*3.6*24","v":0},{"v":1e-06,"d":"0"},{"v":1e-06,"d":"0"}," ",{"v":1e-06,"d":"0"}]
[null,"2002-06-09",160,{"$f":"'JSM Eingabe+TW'!DB40","v":{"v":1e-06,"d":"0"}},0,{"v":1e-06,"d":"0.00"},{"v":1.2e-06,"d":"0"},0,{"$f":"'JSM Eingabe+TW'!$K$18*3.6*24","v":0},{"v":1e-06,"d":"0"},{"v":1e-06,"d":"0"}," ",{"v":1e-06,"d":"0"}]
[null,"2002-06-10",161,{"$f":"'JSM Eingabe+TW'!DB41","v":{"v":1e-06,"d":"0"}},0,{"v":1e-06,"d":"0.00"},{"v":1.2e-06,"d":"0"},0,{"$f":"'JSM Eingabe+TW'!$K$18*3.6*24","v":0},{"v":1e-06,"d":"0"},{"v":1e-06,"d":"0"}," ",{"v":1e-06,"d":"0"}]
[null,"2002-06-11",162,{"$f":"'JSM Eingabe+TW'!DB42","v":{"v":1e-06,"d":"0"}},0,{"v":1e-06,"d":"0.00"},{"v":1.2e-06,"d":"0"},0,{"$f":"'JSM Eingabe+TW'!$K$18*3.6*24","v":0},{"v":1e-06,"d":"0"},{"v":1e-06,"d":"0"}," ",{"v":1e-06,"d":"0"}]
[null,"2002-06-12",163,{"$f":"'JSM Eingabe+TW'!DB43","v":{"v":1e-06,"d":"0"}},0,{"v":1e-06,"d":"0.00"},{"v":1.2e-06,"d":"0"},0,{"$f":"'JSM Eingabe+TW'!$K$18*3.6*24","v":0},{"v":1e-06,"d":"0"},{"v":1e-06,"d":"0"}," ",{"v":1e-06,"d":"0"}]
[null,"2002-06-13",164,{"$f":"'JSM Eingabe+TW'!DB44","v":{"v":1e-06,"d":"0"}},0,{"v":1e-06,"d":"0.00"},{"v":1.2e-06,"d":"0"},0,{"$f":"'JSM Eingabe+TW'!$K$18*3.6*24","v":0},{"v":1e-06,"d":"0"},{"v":1e-06,"d":"0"}," ",{"v":1e-06,"d":"0"}]
[null,"2002-06-14",165,{"$f":"'JSM Eingabe+TW'!DB45","v":{"v":1e-06,"d":"0"}},0,{"v":1e-06,"d":"0.00"},{"v":1.2e-06,"d":"0"},0,{"$f":"'JSM Eingabe+TW'!$K$18*3.6*24","v":0},{"v":1e-06,"d":"0"},{"v":1e-06,"d":"0"}," ",{"v":1e-06,"d":"0"}]
[null,"2002-06-15",166,{"$f":"'JSM Eingabe+TW'!DB46","v":{"v":1e-06,"d":"0"}},0,{"v":1e-06,"d":"0.00"},{"v":1.2e-06,"d":"0"},0,{"$f":"'JSM Eingabe+TW'!$K$18*3.6*24","v":0},{"v":1e-06,"d":"0"},{"v":1e-06,"d":"0"}," ",{"v":1e-06,"d":"0"}]
[null,"2002-06-16",167,{"$f":"'JSM Eingabe+TW'!DB47","v":{"v":1e-06,"d":"0"}},0,{"v":1e-06,"d":"0.00"},{"v":1.2e-06,"d":"0"},0,{"$f":"'JSM Eingabe+TW'!$K$18*3.6*24","v":0},{"v":1e-06,"d":"0"},{"v":1e-06,"d":"0"}," ",{"v":1e-06,"d":"0"}]
[null,"2002-06-17",168,{"$f":"'JSM Eingabe+TW'!DB48","v":{"v":1e-06,"d":"0"}},0,{"v":1e-06,"d":"0.00"},{"v":1.2e-06,"d":"0"},0,{"$f":"'JSM Eingabe+TW'!$K$18*3.6*24","v":0},{"v":1e-06,"d":"0"},{"v":1e-06,"d":"0"}," ",{"v":1e-06,"d":"0"}]
[null,"2002-06-18",169,{"$f":"'JSM Eingabe+TW'!DB49","v":{"v":1e-06,"d":"0"}},0,{"v":1e-06,"d":"0.00"},{"v":1.2e-06,"d":"0"},0,{"$f":"'JSM Eingabe+TW'!$K$18*3.6*24","v":0},{"v":1e-06,"d":"0"},{"v":1e-06,"d":"0"}," ",{"v":1e-06,"d":"0"}]
[null,"2002-06-19",170,{"$f":"'JSM Eingabe+TW'!DB50","v":{"v":1e-06,"d":"0"}},0,{"v":1e-06,"d":"0.00"},{"v":1.2e-06,"d":"0"},0,{"$f":"'JSM Eingabe+TW'!$K$18*3.6*24","v":0},{"v":1e-06,"d":"0"},{"v":1e-06,"d":"0"}," ",{"v":1e-06,"d":"0"}]
[null,"2002-06-20",171,{"$f":"'JSM Eingabe+TW'!DB51","v":{"v":1e-06,"d":"0"}},0,{"v":1e-06,"d":"0.00"},{"v":1.2e-06,"d":"0"},0,{"$f":"'JSM Eingabe+TW'!$K$18*3.6*24","v":0},{"v":1e-06,"d":"0"},{"v":1e-06,"d":"0"}," ",{"v":1e-06,"d":"0"}]
[null,"2002-06-21",172,{"$f":"'JSM Eingabe+TW'!DB52","v":{"v":1e-06,"d":"0"}},0,{"v":1e-06,"d":"0.00"},{"v":1.2e-06,"d":"0"},0,{"$f":"'JSM Eingabe+TW'!$K$18*3.6*24","v":0},{"v":1e-06,"d":"0"},{"v":1e-06,"d":"0"}," ",{"v":1e-06,"d":"0"}]
[null,"2002-06-22",173,{"$f":"'JSM Eingabe+TW'!DB53","v":{"v":1e-06,"d":"0"}},0,{"v":1e-06,"d":"0.00"},{"v":1.2e-06,"d":"0"},0,{"$f":"'JSM Eingabe+TW'!$K$18*3.6*24","v":0},{"v":1e-06,"d":"0"},{"v":1e-06,"d":"0"}," ",{"v":1e-06,"d":"0"}]
[null,"2002-06-23",174,{"$f":"'JSM Eingabe+TW'!DB54","v":{"v":1e-06,"d":"0"}},0,{"v":1e-06,"d":"0.00"},{"v":1.2e-06,"d":"0"},0,{"$f":"'JSM Eingabe+TW'!$K$18*3.6*24","v":0},{"v":1e-06,"d":"0"},{"v":1e-06,"d":"0"}," ",{"v":1e-06,"d":"0"}]
[null,"2002-06-24",175,{"$f":"'JSM Eingabe+TW'!DB55","v":{"v":1e-06,"d":"0"}},0,{"v":1e-06,"d":"0.00"},{"v":1.2e-06,"d":"0"},0,{"$f":"'JSM Eingabe+TW'!$K$18*3.6*24","v":0},{"v":1e-06,"d":"0"},{"v":1e-06,"d":"0"}," ",{"v":1e-06,"d":"0"}]
[null,"2002-06-25",176,{"$f":"'JSM Eingabe+TW'!DB56","v":{"v":1e-06,"d":"0"}},0,{"v":1e-06,"d":"0.00"},{"v":1.2e-06,"d":"0"},0,{"$f":"'JSM Eingabe+TW'!$K$18*3.6*24","v":0},{"v":1e-06,"d":"0"},{"v":1e-06,"d":"0"}," ",{"v":1e-06,"d":"0"}]
[null,"2002-06-26",177,{"$f":"'JSM Eingabe+TW'!DB57","v":{"v":1e-06,"d":"0"}},0,{"v":1e-06,"d":"0.00"},{"v":1.2e-06,"d":"0"},0,{"$f":"'JSM Eingabe+TW'!$K$18*3.6*24","v":0},{"v":1e-06,"d":"0"},{"v":1e-06,"d":"0"}," ",{"v":1e-06,"d":"0"}]
[null,"2002-06-27",178,{"$f":"'JSM Eingabe+TW'!DB58","v":{"v":1e-06,"d":"0"}},0,{"v":1e-06,"d":"0.00"},{"v":1.2e-06,"d":"0"},0,{"$f":"'JSM Eingabe+TW'!$K$18*3.6*24","v":0},{"v":1e-06,"d":"0"},{"v":1e-06,"d":"0"}," ",{"v":1e-06,"d":"0"}]
[null,"2002-06-28",179,{"$f":"'JSM Eingabe+TW'!DB59","v":{"v":1e-06,"d":"0"}},0,{"v":1e-06,"d":"0.00"},{"v":1.2e-06,"d":"0"},0,{"$f":"'JSM Eingabe+TW'!$K$18*3.6*24","v":0},{"v":1e-06,"d":"0"},{"v":1e-06,"d":"0"}," ",{"v":1e-06,"d":"0"}]
[null,"2002-06-29",180,{"$f":"'JSM Eingabe+TW'!DB60","v":{"v":1e-06,"d":"0"}},0,{"v":1e-06,"d":"0.00"},{"v":1.2e-06,"d":"0"},0,{"$f":"'JSM Eingabe+TW'!$K$18*3.6*24","v":0},{"v":1e-06,"d":"0"},{"v":1e-06,"d":"0"}," ",{"v":1e-06,"d":"0"}]
[null,"2002-06-30",181,{"$f":"'JSM Eingabe+TW'!DB61","v":{"v":1e-06,"d":"0"}},0,{"v":1e-06,"d":"0.00"},{"v":1.2e-06,"d":"0"},0,{"$f":"'JSM Eingabe+TW'!$K$18*3.6*24","v":0},{"v":1e-06,"d":"0"},{"v":1e-06,"d":"0"}," ",{"v":1e-06,"d":"0"}]
[null,"2002-07-01",182,{"$f":"'JSM Eingabe+TW'!DC32","v":{"v":1e-06,"d":"0"}},0,{"v":1e-06,"d":"0.00"},{"v":1.2e-06,"d":"0"},0,{"$f":"'JSM Eingabe+TW'!$K$18*3.6*24","v":0},{"v":1e-06,"d":"0"},{"v":1e-06,"d":"0"}," ",{"v":1e-06,"d":"0"}]
[null,"2002-07-02",183,{"$f":"'JSM Eingabe+TW'!DC33","v":{"v":1e-06,"d":"0"}},0,{"v":1e-06,"d":"0.00"},{"v":1.2e-06,"d":"0"},0,{"$f":"'JSM Eingabe+TW'!$K$18*3.6*24","v":0},{"v":1e-06,"d":"0"},{"v":1e-06,"d":"0"}," ",{"v":1e-06,"d":"0"}]
[null,"2002-07-03",184,{"$f":"'JSM Eingabe+TW'!DC34","v":{"v":1e-06,"d":"0"}},0,{"v":1e-06,"d":"0.00"},{"v":1.2e-06,"d":"0"},0,{"$f":"'JSM Eingabe+TW'!$K$18*3.6*24","v":0},{"v":1e-06,"d":"0"},{"v":1e-06,"d":"0"}," ",{"v":1e-06,"d":"0"}]
[null,"2002-07-04",185,{"$f":"'JSM Eingabe+TW'!DC35","v":{"v":1e-06,"d":"0"}},0,{"v":1e-06,"d":"0.00"},{"v":1.2e-06,"d":"0"},0,{"$f":"'JSM Eingabe+TW'!$K$18*3.6*24","v":0},{"v":1e-06,"d":"0"},{"v":1e-06,"d":"0"}," ",{"v":1e-06,"d":"0"}]
[null,"2002-07-05",186,{"$f":"'JSM Eingabe+TW'!DC36","v":{"v":1e-06,"d":"0"}},0,{"v":1e-06,"d":"0.00"},{"v":1.2e-06,"d":"0"},0,{"$f":"'JSM Eingabe+TW'!$K$18*3.6*24","v":0},{"v":1e-06,"d":"0"},{"v":1e-06,"d":"0"}," ",{"v":1e-06,"d":"0"}]
[null,"2002-07-06",187,{"$f":"'JSM Eingabe+TW'!DC37","v":{"v":1e-06,"d":"0"}},0,{"v":1e-06,"d":"0.00"},{"v":1.2e-06,"d":"0"},0,{"$f":"'JSM Eingabe+TW'!$K$18*3.6*24","v":0},{"v":1e-06,"d":"0"},{"v":1e-06,"d":"0"}," ",{"v":1e-06,"d":"0"}]
[null,"2002-07-07",188,{"$f":"'JSM Eingabe+TW'!DC38","v":{"v":1e-06,"d":"0"}},0,{"v":1e-06,"d":"0.00"},{"v":1.2e-06,"d":"0"},0,{"$f":"'JSM Eingabe+TW'!$K$18*3.6*24","v":0},{"v":1e-06,"d":"0"},{"v":1e-06,"d":"0"}," ",{"v":1e-06,"d":"0"}]
[null,"2002-07-08",189,{"$f":"'JSM Eingabe+TW'!DC39","v":{"v":1e-06,"d":"0"}},0,{"v":1e-06,"d":"0.00"},{"v":1.2e-06,"d":"0"},0,{"$f":"'JSM Eingabe+TW'!$K$18*3.6*24","v":0},{"v":1e-06,"d":"0"},{"v":1e-06,"d":"0"}," ",{"v":1e-06,"d":"0"}]
[null,"2002-07-09",190,{"$f":"'JSM Eingabe+TW'!DC40","v":{"v":1e-06,"d":"0"}},0,{"v":1e-06,"d":"0.00"},{"v":1.2e-06,"d":"0"},0,{"$f":"'JSM Eingabe+TW'!$K$18*3.6*24","v":0},{"v":1e-06,"d":"0"},{"v":1e-06,"d":"0"}," ",{"v":1e-06,"d":"0"}]
[null,"2002-07-10",191,{"$f":"'JSM Eingabe+TW'!DC41","v":{"v":1e-06,"d":"0"}},0,{"v":1e-06,"d":"0.00"},{"v":1.2e-06,"d":"0"},0,{"$f":"'JSM Eingabe+TW'!$K$18*3.6*24","v":0},{"v":1e-06,"d":"0"},{"v":1e-06,"d":"0"}," ",{"v":1e-06,"d":"0"}]
[null,"2002-07-11",192,{"$f":"'JSM Eingabe+TW'!DC42","v":{"v":1e-06,"d":"0"}},0,{"v":1e-06,"d":"0.00"},{"v":1.2e-06,"d":"0"},0,{"$f":"'JSM Eingabe+TW'!$K$18*3.6*24","v":0},{"v":1e-06,"d":"0"},{"v":1e-06,"d":"0"}," ",{"v":1e-06,"d":"0"}]
[null,"2002-07-12",193,{"$f":"'JSM Eingabe+TW'!DC43","v":{"v":1e-06,"d":"0"}},0,{"v":1e-06,"d":"0.00"},{"v":1.2e-06,"d":"0"},0,{"$f":"'JSM Eingabe+TW'!$K$18*3.6*24","v":0},{"$f":"IF(D247<=G247,D247,0)","v":{"v":1e-06,"d":"0"}},{"$f":"IF(F247<E247,0,F247-E247)","v":{"v":1e-06,"d":"0"}},{"$f":"IF(M247<0,1, \" \")","v":" "},{"$f":"F247-E247","v":{"v":1e-06,"d":"0"}}]
[null,"2002-07-13",194,{"$f":"'JSM Eingabe+TW'!DC44","v":{"v":1e-06,"d":"0"}},{"$f":"$E$55","v":0},{"v":1e-06,"d":"0.00"},{"$f":"F248*1.2","v":{"v":1.2e-06,"d":"0"}},0,{"$f":"'JSM Eingabe+TW'!$K$18*3.6*24","v":0},{"v":1e-06,"d":"0"},{"v":1e-06,"d":"0"}," ",{"v":1e-06,"d":"0"}]
[null,"2002-07-14",195,{"$f":"'JSM Eingabe+TW'!DC45","v":{"v":1e-06,"d":"0"}},0,{"v":1e-06,"d":"0.00"},{"v":1.2e-06,"d":"0"},{"$f":"H248","v":0},{"$f":"'JSM Eingabe+TW'!$K$18*3.6*24","v":0},{"v":1e-06,"d":"0"},{"v":1e-06,"d":"0"}," ",{"v":1e-06,"d":"0"}]
[null,"2002-07-15",196,{"$f":"'JSM Eingabe+TW'!DC46","v":{"v":1e-06,"d":"0"}},0,{"v":1e-06,"d":"0.00"},{"v":1.2e-06,"d":"0"},0,{"$f":"'JSM Eingabe+TW'!$K$18*3.6*24","v":0},{"v":1e-06,"d":"0"},{"v":1e-06,"d":"0"}," ",{"v":1e-06,"d":"0"}]
[null,"2002-07-16",197,{"$f":"'JSM Eingabe+TW'!DC47","v":{"v":1e-06,"d":"0"}},0,{"v":1e-06,"d":"0.00"},{"v":1.2e-06,"d":"0"},0,{"$f":"'JSM Eingabe+TW'!$K$18*3.6*24","v":0},{"v":1e-06,"d":"0"},{"v":1e-06,"d":"0"}," ",{"v":1e-06,"d":"0"}]
[null,"2002-07-17",198,{"$f":"'JSM Eingabe+TW'!DC48","v":{"v":1e-06,"d":"0"}},0,{"v":1e-06,"d":"0.00"},{"v":1.2e-06,"d":"0"},0,{"$f":"'JSM Eingabe+TW'!$K$18*3.6*24","v":0},{"v":1e-06,"d":"0"},{"v":1e-06,"d":"0"}," ",{"v":1e-06,"d":"0"}]
[null,"2002-07-18",199,{"$f":"'JSM Eingabe+TW'!DC49","v":{"v":1e-06,"d":"0"}},0,{"v":1e-06,"d":"0.00"},{"v":1.2e-06,"d":"0"},0,{"$f":"'JSM Eingabe+TW'!$K$18*3.6*24","v":0},{"v":1e-06,"d":"0"},{"v":1e-06,"d":"0"}," ",{"v":1e-06,"d":"0"}]
[null,"2002-07-19",200,{"$f":"'JSM Eingabe+TW'!DC50","v":{"v":1e-06,"d":"0"}},0,{"v":1e-06,"d":"0.00"},{"v":1.2e-06,"d":"0"},0,{"$f":"'JSM Eingabe+TW'!$K$18*3.6*24","v":0},{"v":1e-06,"d":"0"},{"v":1e-06,"d":"0"}," ",{"v":1e-06,"d":"0"}]
[null,"2002-07-20",201,{"$f":"'JSM Eingabe+TW'!DC51","v":{"v":1e-06,"d":"0"}},0,{"v":1e-06,"d":"0.00"},{"v":1.2e-06,"d":"0"},0,{"$f":"'JSM Eingabe+TW'!$K$18*3.6*24","v":0},{"v":1e-06,"d":"0"},{"v":1e-06,"d":"0"}," ",{"v":1e-06,"d":"0"}]
[null,"2002-07-21",202,{"$f":"'JSM Eingabe+TW'!DC52","v":{"v":1e-06,"d":"0"}},0,{"v":1e-06,"d":"0.00"},{"v":1.2e-06,"d":"0"},0,{"$f":"'JSM Eingabe+TW'!$K$18*3.6*24","v":0},{"v":1e-06,"d":"0"},{"v":1e-06,"d":"0"}," ",{"v":1e-06,"d":"0"}]
[null,"2002-07-22",203,{"$f":"'JSM Eingabe+TW'!DC53","v":{"v":1e-06,"d":"0"}},0,{"v":1e-06,"d":"0.00"},{"v":1.2e-06,"d":"0"},0,{"$f":"'JSM Eingabe+TW'!$K$18*3.6*24","v":0},{"v":1e-06,"d":"0"},{"v":1e-06,"d":"0"}," ",{"v":1e-06,"d":"0"}]
[null,"2002-07-23",204,{"$f":"'JSM Eingabe+TW'!DC54","v":{"v":1e-06,"d":"0"}},0,{"$f":"SMALL(D248:D268,1)","v":{"v":1e-06,"d":"0.00"}},{"v":1.2e-06,"d":"0"},0,{"$f":"'JSM Eingabe+TW'!$K$18*3.6*24","v":0},{"v":1e-06,"d":"0"},{"v":1e-06,"d":"0"}," ",{"v":1e-06,"d":"0"}]
[null,"2002-07-24",205,{"$f":"'JSM Eingabe+TW'!DC55","v":{"v":1e-06,"d":"0"}},0,{"v":1e-06,"d":"0.00"},{"v":1.2e-06,"d":"0"},0,{"$f":"'JSM Eingabe+TW'!$K$18*3.6*24","v":0},{"v":1e-06,"d":"0"},{"v":1e-06,"d":"0"}," ",{"v":1e-06,"d":"0"}]
[null,"2002-07-25",206,{"$f":"'JSM Eingabe+TW'!DC56","v":{"v":1e-06,"d":"0"}},0,{"v":1e-06,"d":"0.00"},{"v":1.2e-06,"d":"0"},0,{"$f":"'JSM Eingabe+TW'!$K$18*3.6*24","v":0},{"v":1e-06,"d":"0"},{"v":1e-06,"d":"0"}," ",{"v":1e-06,"d":"0"}]
[null,"2002-07-26",207,{"$f":"'JSM Eingabe+TW'!DC57","v":{"v":1e-06,"d":"0"}},0,{"v":1e-06,"d":"0.00"},{"v":1.2e-06,"d":"0"},0,{"$f":"'JSM Eingabe+TW'!$K$18*3.6*24","v":0},{"v":1e-06,"d":"0"},{"v":1e-06,"d":"0"}," ",{"v":1e-06,"d":"0"}]
[null,"2002-07-27",208,{"$f":"'JSM Eingabe+TW'!DC58","v":{"v":1e-06,"d":"0"}},0,{"v":1e-06,"d":"0.00"},{"v":1.2e-06,"d":"0"},0,{"$f":"'JSM Eingabe+TW'!$K$18*3.6*24","v":0},{"v":1e-06,"d":"0"},{"v":1e-06,"d":"0"}," ",{"v":1e-06,"d":"0"}]
[null,"2002-07-28",209,{"$f":"'JSM Eingabe+TW'!DC59","v":{"v":1e-06,"d":"0"}},0,{"v":1e-06,"d":"0.00"},{"v":1.2e-06,"d":"0"},0,{"$f":"'JSM Eingabe+TW'!$K$18*3.6*24","v":0},{"v":1e-06,"d":"0"},{"v":1e-06,"d":"0"}," ",{"v":1e-06,"d":"0"}]
[null,"2002-07-29",210,{"$f":"'JSM Eingabe+TW'!DC60","v":{"v":1e-06,"d":"0"}},0,{"v":1e-06,"d":"0.00"},{"v":1.2e-06,"d":"0"},0,{"$f":"'JSM Eingabe+TW'!$K$18*3.6*24","v":0},{"v":1e-06,"d":"0"},{"v":1e-06,"d":"0"}," ",{"v":1e-06,"d":"0"}]
[null,"2002-07-30",211,{"$f":"'JSM Eingabe+TW'!DC61","v":{"v":1e-06,"d":"0"}},0,{"v":1e-06,"d":"0.00"},{"v":1.2e-06,"d":"0"},0,{"$f":"'JSM Eingabe+TW'!$K$18*3.6*24","v":0},{"v":1e-06,"d":"0"},{"v":1e-06,"d":"0"}," ",{"v":1e-06,"d":"0"}]
[null,"2002-07-31",212,{"$f":"'JSM Eingabe+TW'!DC62","v":{"v":1e-06,"d":"0"}},0,{"v":1e-06,"d":"0.00"},{"v":1.2e-06,"d":"0"},0,{"$f":"'JSM Eingabe+TW'!$K$18*3.6*24","v":0},{"v":1e-06,"d":"0"},{"v":1e-06,"d":"0"}," ",{"v":1e-06,"d":"0"}]
[null,"2002-08-01",213,{"$f":"'JSM Eingabe+TW'!DD32","v":{"v":1e-06,"d":"0"}},0,{"v":1e-06,"d":"0.00"},{"v":1.2e-06,"d":"0"},0,{"$f":"'JSM Eingabe+TW'!$K$18*3.6*24","v":0},{"v":1e-06,"d":"0"},{"v":1e-06,"d":"0"}," ",{"v":1e-06,"d":"0"}]
[null,"2002-08-02",214,{"$f":"'JSM Eingabe+TW'!DD33","v":{"v":1e-06,"d":"0"}},0,{"v":1e-06,"d":"0.00"},{"v":1.2e-06,"d":"0"},0,{"$f":"'JSM Eingabe+TW'!$K$18*3.6*24","v":0},{"v":1e-06,"d":"0"},{"v":1e-06,"d":"0"}," ",{"v":1e-06,"d":"0"}]
[null,"2002-08-03",215,{"$f":"'JSM Eingabe+TW'!DD34","v":{"v":1e-06,"d":"0"}},0,{"v":1e-06,"d":"0.00"},{"v":1.2e-06,"d":"0"},0,{"$f":"'JSM Eingabe+TW'!$K$18*3.6*24","v":0},{"v":1e-06,"d":"0"},{"v":1e-06,"d":"0"}," ",{"v":1e-06,"d":"0"}]
[null,"2002-08-04",216,{"$f":"'JSM Eingabe+TW'!DD35","v":{"v":1e-06,"d":"0"}},0,{"v":1e-06,"d":"0.00"},{"v":1.2e-06,"d":"0"},0,{"$f":"'JSM Eingabe+TW'!$K$18*3.6*24","v":0},{"v":1e-06,"d":"0"},{"v":1e-06,"d":"0"}," ",{"v":1e-06,"d":"0"}]
[null,"2002-08-05",217,{"$f":"'JSM Eingabe+TW'!DD36","v":{"v":1e-06,"d":"0"}},0,{"v":1e-06,"d":"0.00"},{"v":1.2e-06,"d":"0"},0,{"$f":"'JSM Eingabe+TW'!$K$18*3.6*24","v":0},{"v":1e-06,"d":"0"},{"v":1e-06,"d":"0"}," ",{"v":1e-06,"d":"0"}]
[null,"2002-08-06",218,{"$f":"'JSM Eingabe+TW'!DD37","v":{"v":1e-06,"d":"0"}},0,{"v":1e-06,"d":"0.00"},{"v":1.2e-06,"d":"0"},0,{"$f":"'JSM Eingabe+TW'!$K$18*3.6*24","v":0},{"v":1e-06,"d":"0"},{"v":1e-06,"d":"0"}," ",{"v":1e-06,"d":"0"}]
[null,"2002-08-07",219,{"$f":"'JSM Eingabe+TW'!DD38","v":{"v":1e-06,"d":"0"}},0,{"v":1e-06,"d":"0.00"},{"v":1.2e-06,"d":"0"},0,{"$f":"'JSM Eingabe+TW'!$K$18*3.6*24","v":0},{"v":1e-06,"d":"0"},{"v":1e-06,"d":"0"}," ",{"v":1e-06,"d":"0"}]
[null,"2002-08-08",220,{"$f":"'JSM Eingabe+TW'!DD39","v":{"v":1e-06,"d":"0"}},0,{"v":1e-06,"d":"0.00"},{"v":1.2e-06,"d":"0"},0,{"$f":"'JSM Eingabe+TW'!$K$18*3.6*24","v":0},{"v":1e-06,"d":"0"},{"v":1e-06,"d":"0"}," ",{"v":1e-06,"d":"0"}]
[null,"2002-08-09",221,{"$f":"'JSM Eingabe+TW'!DD40","v":{"v":1e-06,"d":"0"}},0,{"v":1e-06,"d":"0.00"},{"v":1.2e-06,"d":"0"},0,{"$f":"'JSM Eingabe+TW'!$K$18*3.6*24","v":0},{"v":1e-06,"d":"0"},{"v":1e-06,"d":"0"}," ",{"v":1e-06,"d":"0"}]
[null,"2002-08-10",222,{"$f":"'JSM Eingabe+TW'!DD41","v":{"v":1e-06,"d":"0"}},0,{"v":1e-06,"d":"0.00"},{"v":1.2e-06,"d":"0"},0,{"$f":"'JSM Eingabe+TW'!$K$18*3.6*24","v":0},{"v":1e-06,"d":"0"},{"v":1e-06,"d":"0"}," ",{"v":1e-06,"d":"0"}]
[null,"2002-08-11",223,{"$f":"'JSM Eingabe+TW'!DD42","v":{"v":1e-06,"d":"0"}},0,{"v":1e-06,"d":"0.00"},{"v":1.2e-06,"d":"0"},0,{"$f":"'JSM Eingabe+TW'!$K$18*3.6*24","v":0},{"v":1e-06,"d":"0"},{"v":1e-06,"d":"0"}," ",{"v":1e-06,"d":"0"}]
[null,"2002-08-12",224,{"$f":"'JSM Eingabe+TW'!DD43","v":{"v":1e-06,"d":"0"}},0,{"v":1e-06,"d":"0.00"},{"v":1.2e-06,"d":"0"},0,{"$f":"'JSM Eingabe+TW'!$K$18*3.6*24","v":0},{"v":1e-06,"d":"0"},{"v":1e-06,"d":"0"}," ",{"v":1e-06,"d":"0"}]
[null,"2002-08-13",225,{"$f":"'JSM Eingabe+TW'!DD44","v":{"v":1e-06,"d":"0"}},0,{"v":1e-06,"d":"0.00"},{"v":1.2e-06,"d":"0"},0,{"$f":"'JSM Eingabe+TW'!$K$18*3.6*24","v":0},{"v":1e-06,"d":"0"},{"v":1e-06,"d":"0"}," ",{"v":1e-06,"d":"0"}]
[null,"2002-08-14",226,{"$f":"'JSM Eingabe+TW'!DD45","v":{"v":1e-06,"d":"0"}},0,{"v":1e-06,"d":"0.00"},{"v":1.2e-06,"d":"0"},0,{"$f":"'JSM Eingabe+TW'!$K$18*3.6*24","v":0},{"v":1e-06,"d":"0"},{"v":1e-06,"d":"0"}," ",{"v":1e-06,"d":"0"}]
[null,"2002-08-15",227,{"$f":"'JSM Eingabe+TW'!DD46","v":{"v":1e-06,"d":"0"}},0,{"v":1e-06,"d":"0.00"},{"v":1.2e-06,"d":"0"},0,{"$f":"'JSM Eingabe+TW'!$K$18*3.6*24","v":0},{"v":1e-06,"d":"0"},{"v":1e-06,"d":"0"}," ",{"v":1e-06,"d":"0"}]
[null,"2002-08-16",228,{"$f":"'JSM Eingabe+TW'!DD47","v":{"v":1e-06,"d":"0"}},0,{"v":1e-06,"d":"0.00"},{"v":1.2e-06,"d":"0"},0,{"$f":"'JSM Eingabe+TW'!$K$18*3.6*24","v":0},{"v":1e-06,"d":"0"},{"v":1e-06,"d":"0"}," ",{"v":1e-06,"d":"0"}]
[null,"2002-08-17",229,{"$f":"'JSM Eingabe+TW'!DD48","v":{"v":1e-06,"d":"0"}},0,{"v":1e-06,"d":"0.00"},{"v":1.2e-06,"d":"0"},0,{"$f":"'JSM Eingabe+TW'!$K$18*3.6*24","v":0},{"v":1e-06,"d":"0"},{"v":1e-06,"d":"0"}," ",{"v":1e-06,"d":"0"}]
[null,"2002-08-18",230,{"$f":"'JSM Eingabe+TW'!DD49","v":{"v":1e-06,"d":"0"}},0,{"v":1e-06,"d":"0.00"},{"v":1.2e-06,"d":"0"},0,{"$f":"'JSM Eingabe+TW'!$K$18*3.6*24","v":0},{"v":1e-06,"d":"0"},{"v":1e-06,"d":"0"}," ",{"v":1e-06,"d":"0"}]
[null,"2002-08-19",231,{"$f":"'JSM Eingabe+TW'!DD50","v":{"v":1e-06,"d":"0"}},0,{"v":1e-06,"d":"0.00"},{"v":1.2e-06,"d":"0"},0,{"$f":"'JSM Eingabe+TW'!$K$18*3.6*24","v":0},{"v":1e-06,"d":"0"},{"v":1e-06,"d":"0"}," ",{"v":1e-06,"d":"0"}]
[null,"2002-08-20",232,{"$f":"'JSM Eingabe+TW'!DD51","v":{"v":1e-06,"d":"0"}},0,{"v":1e-06,"d":"0.00"},{"v":1.2e-06,"d":"0"},0,{"$f":"'JSM Eingabe+TW'!$K$18*3.6*24","v":0},{"v":1e-06,"d":"0"},{"v":1e-06,"d":"0"}," ",{"v":1e-06,"d":"0"}]
[null,"2002-08-21",233,{"$f":"'JSM Eingabe+TW'!DD52","v":{"v":1e-06,"d":"0"}},0,{"v":1e-06,"d":"0.00"},{"v":1.2e-06,"d":"0"},0,{"$f":"'JSM Eingabe+TW'!$K$18*3.6*24","v":0},{"v":1e-06,"d":"0"},{"v":1e-06,"d":"0"}," ",{"v":1e-06,"d":"0"}]
[null,"2002-08-22",234,{"$f":"'JSM Eingabe+TW'!DD53","v":{"v":1e-06,"d":"0"}},0,{"v":1e-06,"d":"0.00"},{"v":1.2e-06,"d":"0"},0,{"$f":"'JSM Eingabe+TW'!$K$18*3.6*24","v":0},{"v":1e-06,"d":"0"},{"v":1e-06,"d":"0"}," ",{"v":1e-06,"d":"0"}]
[null,"2002-08-23",235,{"$f":"'JSM Eingabe+TW'!DD54","v":{"v":1e-06,"d":"0"}},0,{"v":1e-06,"d":"0.00"},{"v":1.2e-06,"d":"0"},0,{"$f":"'JSM Eingabe+TW'!$K$18*3.6*24","v":0},{"v":1e-06,"d":"0"},{"v":1e-06,"d":"0"}," ",{"v":1e-06,"d":"0"}]
[null,"2002-08-24",236,{"$f":"'JSM Eingabe+TW'!DD55","v":{"v":1e-06,"d":"0"}},0,{"v":1e-06,"d":"0.00"},{"v":1.2e-06,"d":"0"},0,{"$f":"'JSM Eingabe+TW'!$K$18*3.6*24","v":0},{"v":1e-06,"d":"0"},{"v":1e-06,"d":"0"}," ",{"v":1e-06,"d":"0"}]
[null,"2002-08-25",237,{"$f":"'JSM Eingabe+TW'!DD56","v":{"v":1e-06,"d":"0"}},0,{"v":1e-06,"d":"0.00"},{"v":1.2e-06,"d":"0"},0,{"$f":"'JSM Eingabe+TW'!$K$18*3.6*24","v":0},{"v":1e-06,"d":"0"},{"v":1e-06,"d":"0"}," ",{"v":1e-06,"d":"0"}]
[null,"2002-08-26",238,{"$f":"'JSM Eingabe+TW'!DD57","v":{"v":1e-06,"d":"0"}},0,{"v":1e-06,"d":"0.00"},{"v":1.2e-06,"d":"0"},0,{"$f":"'JSM Eingabe+TW'!$K$18*3.6*24","v":0},{"v":1e-06,"d":"0"},{"v":1e-06,"d":"0"}," ",{"v":1e-06,"d":"0"}]
[null,"2002-08-27",239,{"$f":"'JSM Eingabe+TW'!DD58","v":{"v":1e-06,"d":"0"}},0,{"v":1e-06,"d":"0.00"},{"v":1.2e-06,"d":"0"},0,{"$f":"'JSM Eingabe+TW'!$K$18*3.6*24","v":0},{"v":1e-06,"d":"0"},{"v":1e-06,"d":"0"}," ",{"v":1e-06,"d":"0"}]
[null,"2002-08-28",240,{"$f":"'JSM Eingabe+TW'!DD59","v":{"v":1e-06,"d":"0"}},0,{"v":1e-06,"d":"0.00"},{"v":1.2e-06,"d":"0"},0,{"$f":"'JSM Eingabe+TW'!$K$18*3.6*24","v":0},{"v":1e-06,"d":"0"},{"v":1e-06,"d":"0"}," ",{"v":1e-06,"d":"0"}]
[null,"2002-08-29",241,{"$f":"'JSM Eingabe+TW'!DD60","v":{"v":1e-06,"d":"0"}},0,{"v":1e-06,"d":"0.00"},{"v":1.2e-06,"d":"0"},0,{"$f":"'JSM Eingabe+TW'!$K$18*3.6*24","v":0},{"v":1e-06,"d":"0"},{"v":1e-06,"d":"0"}," ",{"v":1e-06,"d":"0"}]
[null,"2002-08-30",242,{"$f":"'JSM Eingabe+TW'!DD61","v":{"v":1e-06,"d":"0"}},0,{"v":1e-06,"d":"0.00"},{"v":1.2e-06,"d":"0"},0,{"$f":"'JSM Eingabe+TW'!$K$18*3.6*24","v":0},{"v":1e-06,"d":"0"},{"v":1e-06,"d":"0"}," ",{"v":1e-06,"d":"0"}]
[null,"2002-08-31",243,{"$f":"'JSM Eingabe+TW'!DD62","v":{"v":1e-06,"d":"0"}},0,{"v":1e-06,"d":"0.00"},{"v":1.2e-06,"d":"0"},0,{"$f":"'JSM Eingabe+TW'!$K$18*3.6*24","v":0},{"v":1e-06,"d":"0"},{"v":1e-06,"d":"0"}," ",{"v":1e-06,"d":"0"}]
[null,"2002-09-01",244,{"$f":"'JSM Eingabe+TW'!DE32","v":{"v":1e-06,"d":"0"}},0,{"v":1e-06,"d":"0.00"},{"v":1.2e-06,"d":"0"},0,{"$f":"'JSM Eingabe+TW'!$K$18*3.6*24","v":0},{"v":1e-06,"d":"0"},{"v":1e-06,"d":"0"}," ",{"v":1e-06,"d":"0"}]
[null,"2002-09-02",245,{"$f":"'JSM Eingabe+TW'!DE33","v":{"v":1e-06,"d":"0"}},0,{"v":1e-06,"d":"0.00"},{"v":1.2e-06,"d":"0"},0,{"$f":"'JSM Eingabe+TW'!$K$18*3.6*24","v":0},{"v":1e-06,"d":"0"},{"v":1e-06,"d":"0"}," ",{"v":1e-06,"d":"0"}]
[null,"2002-09-03",246,{"$f":"'JSM Eingabe+TW'!DE34","v":{"v":1e-06,"d":"0"}},0,{"v":1e-06,"d":"0.00"},{"v":1.2e-06,"d":"0"},0,{"$f":"'JSM Eingabe+TW'!$K$18*3.6*24","v":0},{"v":1e-06,"d":"0"},{"v":1e-06,"d":"0"}," ",{"v":1e-06,"d":"0"}]
[null,"2002-09-04",247,{"$f":"'JSM Eingabe+TW'!DE35","v":{"v":1e-06,"d":"0"}},0,{"v":1e-06,"d":"0.00"},{"v":1.2e-06,"d":"0"},0,{"$f":"'JSM Eingabe+TW'!$K$18*3.6*24","v":0},{"v":1e-06,"d":"0"},{"v":1e-06,"d":"0"}," ",{"v":1e-06,"d":"0"}]
[null,"2002-09-05",248,{"$f":"'JSM Eingabe+TW'!DE36","v":{"v":1e-06,"d":"0"}},0,{"v":1e-06,"d":"0.00"},{"v":1.2e-06,"d":"0"},0,{"$f":"'JSM Eingabe+TW'!$K$18*3.6*24","v":0},{"v":1e-06,"d":"0"},{"v":1e-06,"d":"0"}," ",{"v":1e-06,"d":"0"}]
[null,"2002-09-06",249,{"$f":"'JSM Eingabe+TW'!DE37","v":{"v":1e-06,"d":"0"}},0,{"v":1e-06,"d":"0.00"},{"v":1.2e-06,"d":"0"},0,{"$f":"'JSM Eingabe+TW'!$K$18*3.6*24","v":0},{"v":1e-06,"d":"0"},{"v":1e-06,"d":"0"}," ",{"v":1e-06,"d":"0"}]
[null,"2002-09-07",250,{"$f":"'JSM Eingabe+TW'!DE38","v":{"v":1e-06,"d":"0"}},0,{"v":1e-06,"d":"0.00"},{"v":1.2e-06,"d":"0"},0,{"$f":"'JSM Eingabe+TW'!$K$18*3.6*24","v":0},{"v":1e-06,"d":"0"},{"v":1e-06,"d":"0"}," ",{"v":1e-06,"d":"0"}]
[null,"2002-09-08",251,{"$f":"'JSM Eingabe+TW'!DE39","v":{"v":1e-06,"d":"0"}},0,{"v":1e-06,"d":"0.00"},{"v":1.2e-06,"d":"0"},0,{"$f":"'JSM Eingabe+TW'!$K$18*3.6*24","v":0},{"v":1e-06,"d":"0"},{"v":1e-06,"d":"0"}," ",{"v":1e-06,"d":"0"}]
[null,"2002-09-09",252,{"$f":"'JSM Eingabe+TW'!DE40","v":{"v":1e-06,"d":"0"}},0,{"v":1e-06,"d":"0.00"},{"v":1.2e-06,"d":"0"},0,{"$f":"'JSM Eingabe+TW'!$K$18*3.6*24","v":0},{"v":1e-06,"d":"0"},{"v":1e-06,"d":"0"}," ",{"v":1e-06,"d":"0"}]
[null,"2002-09-10",253,{"$f":"'JSM Eingabe+TW'!DE41","v":{"v":1e-06,"d":"0"}},0,{"v":1e-06,"d":"0.00"},{"v":1.2e-06,"d":"0"},0,{"$f":"'JSM Eingabe+TW'!$K$18*3.6*24","v":0},{"v":1e-06,"d":"0"},{"v":1e-06,"d":"0"}," ",{"v":1e-06,"d":"0"}]
[null,"2002-09-11",254,{"$f":"'JSM Eingabe+TW'!DE42","v":{"v":1e-06,"d":"0"}},0,{"v":1e-06,"d":"0.00"},{"v":1.2e-06,"d":"0"},0,{"$f":"'JSM Eingabe+TW'!$K$18*3.6*24","v":0},{"v":1e-06,"d":"0"},{"v":1e-06,"d":"0"}," ",{"v":1e-06,"d":"0"}]
[null,"2002-09-12",255,{"$f":"'JSM Eingabe+TW'!DE43","v":{"v":1e-06,"d":"0"}},0,{"v":1e-06,"d":"0.00"},{"v":1.2e-06,"d":"0"},0,{"$f":"'JSM Eingabe+TW'!$K$18*3.6*24","v":0},{"v":1e-06,"d":"0"},{"v":1e-06,"d":"0"}," ",{"v":1e-06,"d":"0"}]
[null,"2002-09-13",256,{"$f":"'JSM Eingabe+TW'!DE44","v":{"v":1e-06,"d":"0"}},0,{"v":1e-06,"d":"0.00"},{"v":1.2e-06,"d":"0"},0,{"$f":"'JSM Eingabe+TW'!$K$18*3.6*24","v":0},{"v":1e-06,"d":"0"},{"v":1e-06,"d":"0"}," ",{"v":1e-06,"d":"0"}]
[null,"2002-09-14",257,{"$f":"'JSM Eingabe+TW'!DE45","v":{"v":1e-06,"d":"0"}},0,{"v":1e-06,"d":"0.00"},{"v":1.2e-06,"d":"0"},0,{"$f":"'JSM Eingabe+TW'!$K$18*3.6*24","v":0},{"$f":"IF(D311<=G311,D311,0)","v":{"v":1e-06,"d":"0"}},{"$f":"IF(F311<E311,0,F311-E311)","v":{"v":1e-06,"d":"0"}},{"$f":"IF(M311<0,1, \" \")","v":" "},{"$f":"F311-E311","v":{"v":1e-06,"d":"0"}}]
[null,"2002-09-15",258,{"$f":"'JSM Eingabe+TW'!DE46","v":{"v":1e-06,"d":"0"}},{"$f":"$E$55","v":0},{"v":1e-06,"d":"0.00"},{"$f":"F312*1.2","v":{"v":1.2e-06,"d":"0"}},0,{"$f":"'JSM Eingabe+TW'!$K$18*3.6*24","v":0},{"v":1e-06,"d":"0"},{"v":1e-06,"d":"0"}," ",{"v":1e-06,"d":"0"}]
[null,"2002-09-16",259,{"$f":"'JSM Eingabe+TW'!DE47","v":{"v":1e-06,"d":"0"}},0,{"v":1e-06,"d":"0.00"},{"v":1.2e-06,"d":"0"},{"$f":"H312","v":0},{"$f":"'JSM Eingabe+TW'!$K$18*3.6*24","v":0},{"v":1e-06,"d":"0"},{"v":1e-06,"d":"0"}," ",{"v":1e-06,"d":"0"}]
[null,"2002-09-17",260,{"$f":"'JSM Eingabe+TW'!DE48","v":{"v":1e-06,"d":"0"}},0,{"v":1e-06,"d":"0.00"},{"v":1.2e-06,"d":"0"},0,{"$f":"'JSM Eingabe+TW'!$K$18*3.6*24","v":0},{"v":1e-06,"d":"0"},{"v":1e-06,"d":"0"}," ",{"v":1e-06,"d":"0"}]
[null,"2002-09-18",261,{"$f":"'JSM Eingabe+TW'!DE49","v":{"v":1e-06,"d":"0"}},0,{"v":1e-06,"d":"0.00"},{"v":1.2e-06,"d":"0"},0,{"$f":"'JSM Eingabe+TW'!$K$18*3.6*24","v":0},{"v":1e-06,"d":"0"},{"v":1e-06,"d":"0"}," ",{"v":1e-06,"d":"0"}]
[null,"2002-09-19",262,{"$f":"'JSM Eingabe+TW'!DE50","v":{"v":1e-06,"d":"0"}},0,{"v":1e-06,"d":"0.00"},{"v":1.2e-06,"d":"0"},0,{"$f":"'JSM Eingabe+TW'!$K$18*3.6*24","v":0},{"v":1e-06,"d":"0"},{"v":1e-06,"d":"0"}," ",{"v":1e-06,"d":"0"}]
[null,"2002-09-20",263,{"$f":"'JSM Eingabe+TW'!DE51","v":{"v":1e-06,"d":"0"}},0,{"v":1e-06,"d":"0.00"},{"v":1.2e-06,"d":"0"},0,{"$f":"'JSM Eingabe+TW'!$K$18*3.6*24","v":0},{"v":1e-06,"d":"0"},{"v":1e-06,"d":"0"}," ",{"v":1e-06,"d":"0"}]
[null,"2002-09-21",264,{"$f":"'JSM Eingabe+TW'!DE52","v":{"v":1e-06,"d":"0"}},0,{"v":1e-06,"d":"0.00"},{"v":1.2e-06,"d":"0"},0,{"$f":"'JSM Eingabe+TW'!$K$18*3.6*24","v":0},{"v":1e-06,"d":"0"},{"v":1e-06,"d":"0"}," ",{"v":1e-06,"d":"0"}]
[null,"2002-09-22",265,{"$f":"'JSM Eingabe+TW'!DE53","v":{"v":1e-06,"d":"0"}},0,{"v":1e-06,"d":"0.00"},{"v":1.2e-06,"d":"0"},0,{"$f":"'JSM Eingabe+TW'!$K$18*3.6*24","v":0},{"v":1e-06,"d":"0"},{"v":1e-06,"d":"0"}," ",{"v":1e-06,"d":"0"}]
[null,"2002-09-23",266,{"$f":"'JSM Eingabe+TW'!DE54","v":{"v":1e-06,"d":"0"}},0,{"v":1e-06,"d":"0.00"},{"v":1.2e-06,"d":"0"},0,{"$f":"'JSM Eingabe+TW'!$K$18*3.6*24","v":0},{"v":1e-06,"d":"0"},{"v":1e-06,"d":"0"}," ",{"v":1e-06,"d":"0"}]
[null,"2002-09-24",267,{"$f":"'JSM Eingabe+TW'!DE55","v":{"v":1e-06,"d":"0"}},0,{"v":1e-06,"d":"0.00"},{"v":1.2e-06,"d":"0"},0,{"$f":"'JSM Eingabe+TW'!$K$18*3.6*24","v":0},{"v":1e-06,"d":"0"},{"v":1e-06,"d":"0"}," ",{"v":1e-06,"d":"0"}]
[null,"2002-09-25",268,{"$f":"'JSM Eingabe+TW'!DE56","v":{"v":1e-06,"d":"0"}},0,{"$f":"SMALL(D312:D332,1)","v":{"v":1e-06,"d":"0.00"}},{"v":1.2e-06,"d":"0"},0,{"$f":"'JSM Eingabe+TW'!$K$18*3.6*24","v":0},{"v":1e-06,"d":"0"},{"v":1e-06,"d":"0"}," ",{"v":1e-06,"d":"0"}]
[null,"2002-09-26",269,{"$f":"'JSM Eingabe+TW'!DE57","v":{"v":1e-06,"d":"0"}},0,{"v":1e-06,"d":"0.00"},{"v":1.2e-06,"d":"0"},0,{"$f":"'JSM Eingabe+TW'!$K$18*3.6*24","v":0},{"v":1e-06,"d":"0"},{"v":1e-06,"d":"0"}," ",{"v":1e-06,"d":"0"}]
[null,"2002-09-27",270,{"$f":"'JSM Eingabe+TW'!DE58","v":{"v":1e-06,"d":"0"}},0,{"v":1e-06,"d":"0.00"},{"v":1.2e-06,"d":"0"},0,{"$f":"'JSM Eingabe+TW'!$K$18*3.6*24","v":0},{"v":1e-06,"d":"0"},{"v":1e-06,"d":"0"}," ",{"v":1e-06,"d":"0"}]
[null,"2002-09-28",271,{"$f":"'JSM Eingabe+TW'!DE59","v":{"v":1e-06,"d":"0"}},0,{"v":1e-06,"d":"0.00"},{"v":1.2e-06,"d":"0"},0,{"$f":"'JSM Eingabe+TW'!$K$18*3.6*24","v":0},{"v":1e-06,"d":"0"},{"v":1e-06,"d":"0"}," ",{"v":1e-06,"d":"0"}]
[null,"2002-09-29",272,{"$f":"'JSM Eingabe+TW'!DE60","v":{"v":1e-06,"d":"0"}},0,{"v":1e-06,"d":"0.00"},{"v":1.2e-06,"d":"0"},0,{"$f":"'JSM Eingabe+TW'!$K$18*3.6*24","v":0},{"v":1e-06,"d":"0"},{"v":1e-06,"d":"0"}," ",{"v":1e-06,"d":"0"}]
[null,"2002-09-30",273,{"$f":"'JSM Eingabe+TW'!DE61","v":{"v":1e-06,"d":"0"}},0,{"v":1e-06,"d":"0.00"},{"v":1.2e-06,"d":"0"},0,{"$f":"'JSM Eingabe+TW'!$K$18*3.6*24","v":0},{"v":1e-06,"d":"0"},{"v":1e-06,"d":"0"}," ",{"v":1e-06,"d":"0"}]
[null,"2002-10-01",274,{"$f":"'JSM Eingabe+TW'!DF32","v":{"v":1e-06,"d":"0"}},0,{"v":1e-06,"d":"0.00"},{"v":1.2e-06,"d":"0"},0,{"$f":"'JSM Eingabe+TW'!$K$18*3.6*24","v":0},{"v":1e-06,"d":"0"},{"v":1e-06,"d":"0"}," ",{"v":1e-06,"d":"0"}]
[null,"2002-10-02",275,{"$f":"'JSM Eingabe+TW'!DF33","v":{"v":1e-06,"d":"0"}},0,{"v":1e-06,"d":"0.00"},{"v":1.2e-06,"d":"0"},0,{"$f":"'JSM Eingabe+TW'!$K$18*3.6*24","v":0},{"v":1e-06,"d":"0"},{"v":1e-06,"d":"0"}," ",{"v":1e-06,"d":"0"}]
[null,"2002-10-03",276,{"$f":"'JSM Eingabe+TW'!DF34","v":{"v":1e-06,"d":"0"}},0,{"v":1e-06,"d":"0.00"},{"v":1.2e-06,"d":"0"},0,{"$f":"'JSM Eingabe+TW'!$K$18*3.6*24","v":0},{"v":1e-06,"d":"0"},{"v":1e-06,"d":"0"}," ",{"v":1e-06,"d":"0"}]
[null,"2002-10-04",277,{"$f":"'JSM Eingabe+TW'!DF35","v":{"v":1e-06,"d":"0"}},0,{"v":1e-06,"d":"0.00"},{"v":1.2e-06,"d":"0"},0,{"$f":"'JSM Eingabe+TW'!$K$18*3.6*24","v":0},{"v":1e-06,"d":"0"},{"v":1e-06,"d":"0"}," ",{"v":1e-06,"d":"0"}]
[null,"2002-10-05",278,{"$f":"'JSM Eingabe+TW'!DF36","v":{"v":1e-06,"d":"0"}},0,{"v":1e-06,"d":"0.00"},{"v":1.2e-06,"d":"0"},0,{"$f":"'JSM Eingabe+TW'!$K$18*3.6*24","v":0},{"v":1e-06,"d":"0"},{"v":1e-06,"d":"0"}," ",{"v":1e-06,"d":"0"}]
[null,"2002-10-06",279,{"$f":"'JSM Eingabe+TW'!DF37","v":{"v":1e-06,"d":"0"}},0,{"v":1e-06,"d":"0.00"},{"v":1.2e-06,"d":"0"},0,{"$f":"'JSM Eingabe+TW'!$K$18*3.6*24","v":0},{"v":1e-06,"d":"0"},{"v":1e-06,"d":"0"}," ",{"v":1e-06,"d":"0"}]
[null,"2002-10-07",280,{"$f":"'JSM Eingabe+TW'!DF38","v":{"v":1e-06,"d":"0"}},0,{"v":1e-06,"d":"0.00"},{"v":1.2e-06,"d":"0"},0,{"$f":"'JSM Eingabe+TW'!$K$18*3.6*24","v":0},{"v":1e-06,"d":"0"},{"v":1e-06,"d":"0"}," ",{"v":1e-06,"d":"0"}]
[null,"2002-10-08",281,{"$f":"'JSM Eingabe+TW'!DF39","v":{"v":1e-06,"d":"0"}},0,{"v":1e-06,"d":"0.00"},{"v":1.2e-06,"d":"0"},0,{"$f":"'JSM Eingabe+TW'!$K$18*3.6*24","v":0},{"v":1e-06,"d":"0"},{"v":1e-06,"d":"0"}," ",{"v":1e-06,"d":"0"}]
[null,"2002-10-09",282,{"$f":"'JSM Eingabe+TW'!DF40","v":{"v":1e-06,"d":"0"}},0,{"v":1e-06,"d":"0.00"},{"v":1.2e-06,"d":"0"},0,{"$f":"'JSM Eingabe+TW'!$K$18*3.6*24","v":0},{"v":1e-06,"d":"0"},{"v":1e-06,"d":"0"}," ",{"v":1e-06,"d":"0"}]
[null,"2002-10-10",283,{"$f":"'JSM Eingabe+TW'!DF41","v":{"v":1e-06,"d":"0"}},0,{"v":1e-06,"d":"0.00"},{"v":1.2e-06,"d":"0"},0,{"$f":"'JSM Eingabe+TW'!$K$18*3.6*24","v":0},{"v":1e-06,"d":"0"},{"v":1e-06,"d":"0"}," ",{"v":1e-06,"d":"0"}]
[null,"2002-10-11",284,{"$f":"'JSM Eingabe+TW'!DF42","v":{"v":1e-06,"d":"0"}},0,{"v":1e-06,"d":"0.00"},{"v":1.2e-06,"d":"0"},0,{"$f":"'JSM Eingabe+TW'!$K$18*3.6*24","v":0},{"v":1e-06,"d":"0"},{"v":1e-06,"d":"0"}," ",{"v":1e-06,"d":"0"}]
[null,"2002-10-12",285,{"$f":"'JSM Eingabe+TW'!DF43","v":{"v":1e-06,"d":"0"}},0,{"v":1e-06,"d":"0.00"},{"v":1.2e-06,"d":"0"},0,{"$f":"'JSM Eingabe+TW'!$K$18*3.6*24","v":0},{"v":1e-06,"d":"0"},{"v":1e-06,"d":"0"}," ",{"v":1e-06,"d":"0"}]
[null,"2002-10-13",286,{"$f":"'JSM Eingabe+TW'!DF44","v":{"v":1e-06,"d":"0"}},0,{"v":1e-06,"d":"0.00"},{"v":1.2e-06,"d":"0"},0,{"$f":"'JSM Eingabe+TW'!$K$18*3.6*24","v":0},{"v":1e-06,"d":"0"},{"v":1e-06,"d":"0"}," ",{"v":1e-06,"d":"0"}]
[null,"2002-10-14",287,{"$f":"'JSM Eingabe+TW'!DF45","v":{"v":1e-06,"d":"0"}},0,{"v":1e-06,"d":"0.00"},{"v":1.2e-06,"d":"0"},0,{"$f":"'JSM Eingabe+TW'!$K$18*3.6*24","v":0},{"v":1e-06,"d":"0"},{"v":1e-06,"d":"0"}," ",{"v":1e-06,"d":"0"}]
[null,"2002-10-15",288,{"$f":"'JSM Eingabe+TW'!DF46","v":{"v":1e-06,"d":"0"}},0,{"v":1e-06,"d":"0.00"},{"v":1.2e-06,"d":"0"},0,{"$f":"'JSM Eingabe+TW'!$K$18*3.6*24","v":0},{"v":1e-06,"d":"0"},{"v":1e-06,"d":"0"}," ",{"v":1e-06,"d":"0"}]
[null,"2002-10-16",289,{"$f":"'JSM Eingabe+TW'!DF47","v":{"v":1e-06,"d":"0"}},0,{"v":1e-06,"d":"0.00"},{"v":1.2e-06,"d":"0"},0,{"$f":"'JSM Eingabe+TW'!$K$18*3.6*24","v":0},{"v":1e-06,"d":"0"},{"v":1e-06,"d":"0"}," ",{"v":1e-06,"d":"0"}]
[null,"2002-10-17",290,{"$f":"'JSM Eingabe+TW'!DF48","v":{"v":1e-06,"d":"0"}},0,{"v":1e-06,"d":"0.00"},{"v":1.2e-06,"d":"0"},0,{"$f":"'JSM Eingabe+TW'!$K$18*3.6*24","v":0},{"v":1e-06,"d":"0"},{"v":1e-06,"d":"0"}," ",{"v":1e-06,"d":"0"}]
[null,"2002-10-18",291,{"$f":"'JSM Eingabe+TW'!DF49","v":{"v":1e-06,"d":"0"}},0,{"v":1e-06,"d":"0.00"},{"v":1.2e-06,"d":"0"},0,{"$f":"'JSM Eingabe+TW'!$K$18*3.6*24","v":0},{"v":1e-06,"d":"0"},{"v":1e-06,"d":"0"}," ",{"v":1e-06,"d":"0"}]
[null,"2002-10-19",292,{"$f":"'JSM Eingabe+TW'!DF50","v":{"v":1e-06,"d":"0"}},0,{"v":1e-06,"d":"0.00"},{"v":1.2e-06,"d":"0"},0,{"$f":"'JSM Eingabe+TW'!$K$18*3.6*24","v":0},{"v":1e-06,"d":"0"},{"v":1e-06,"d":"0"}," ",{"v":1e-06,"d":"0"}]
[null,"2002-10-20",293,{"$f":"'JSM Eingabe+TW'!DF51","v":{"v":1e-06,"d":"0"}},0,{"v":1e-06,"d":"0.00"},{"v":1.2e-06,"d":"0"},0,{"$f":"'JSM Eingabe+TW'!$K$18*3.6*24","v":0},{"v":1e-06,"d":"0"},{"v":1e-06,"d":"0"}," ",{"v":1e-06,"d":"0"}]
[null,"2002-10-21",294,{"$f":"'JSM Eingabe+TW'!DF52","v":{"v":1e-06,"d":"0"}},0,{"v":1e-06,"d":"0.00"},{"v":1.2e-06,"d":"0"},0,{"$f":"'JSM Eingabe+TW'!$K$18*3.6*24","v":0},{"v":1e-06,"d":"0"},{"v":1e-06,"d":"0"}," ",{"v":1e-06,"d":"0"}]
[null,"2002-10-22",295,{"$f":"'JSM Eingabe+TW'!DF53","v":{"v":1e-06,"d":"0"}},0,{"v":1e-06,"d":"0.00"},{"v":1.2e-06,"d":"0"},0,{"$f":"'JSM Eingabe+TW'!$K$18*3.6*24","v":0},{"v":1e-06,"d":"0"},{"v":1e-06,"d":"0"}," ",{"v":1e-06,"d":"0"}]
[null,"2002-10-23",296,{"$f":"'JSM Eingabe+TW'!DF54","v":{"v":1e-06,"d":"0"}},0,{"v":1e-06,"d":"0.00"},{"v":1.2e-06,"d":"0"},0,{"$f":"'JSM Eingabe+TW'!$K$18*3.6*24","v":0},{"v":1e-06,"d":"0"},{"v":1e-06,"d":"0"}," ",{"v":1e-06,"d":"0"}]
[null,"2002-10-24",297,{"$f":"'JSM Eingabe+TW'!DF55","v":{"v":1e-06,"d":"0"}},0,{"v":1e-06,"d":"0.00"},{"v":1.2e-06,"d":"0"},0,{"$f":"'JSM Eingabe+TW'!$K$18*3.6*24","v":0},{"v":1e-06,"d":"0"},{"v":1e-06,"d":"0"}," ",{"v":1e-06,"d":"0"}]
[null,"2002-10-25",298,{"$f":"'JSM Eingabe+TW'!DF56","v":{"v":1e-06,"d":"0"}},0,{"v":1e-06,"d":"0.00"},{"v":1.2e-06,"d":"0"},0,{"$f":"'JSM Eingabe+TW'!$K$18*3.6*24","v":0},{"v":1e-06,"d":"0"},{"v":1e-06,"d":"0"}," ",{"v":1e-06,"d":"0"}]
[null,"2002-10-26",299,{"$f":"'JSM Eingabe+TW'!DF57","v":{"v":1e-06,"d":"0"}},0,{"v":1e-06,"d":"0.00"},{"v":1.2e-06,"d":"0"},0,{"$f":"'JSM Eingabe+TW'!$K$18*3.6*24","v":0},{"v":1e-06,"d":"0"},{"v":1e-06,"d":"0"}," ",{"v":1e-06,"d":"0"}]
[null,"2002-10-27",300,{"$f":"'JSM Eingabe+TW'!DF58","v":{"v":1e-06,"d":"0"}},0,{"v":1e-06,"d":"0.00"},{"v":1.2e-06,"d":"0"},0,{"$f":"'JSM Eingabe+TW'!$K$18*3.6*24","v":0},{"v":1e-06,"d":"0"},{"v":1e-06,"d":"0"}," ",{"v":1e-06,"d":"0"}]
[null,"2002-10-28",301,{"$f":"'JSM Eingabe+TW'!DF59","v":{"v":1e-06,"d":"0"}},0,{"v":1e-06,"d":"0.00"},{"v":1.2e-06,"d":"0"},0,{"$f":"'JSM Eingabe+TW'!$K$18*3.6*24","v":0},{"v":1e-06,"d":"0"},{"v":1e-06,"d":"0"}," ",{"v":1e-06,"d":"0"}]
[null,"2002-10-29",302,{"$f":"'JSM Eingabe+TW'!DF60","v":{"v":1e-06,"d":"0"}},0,{"v":1e-06,"d":"0.00"},{"v":1.2e-06,"d":"0"},0,{"$f":"'JSM Eingabe+TW'!$K$18*3.6*24","v":0},{"v":1e-06,"d":"0"},{"v":1e-06,"d":"0"}," ",{"v":1e-06,"d":"0"}]
[null,"2002-10-30",303,{"$f":"'JSM Eingabe+TW'!DF61","v":{"v":1e-06,"d":"0"}},0,{"v":1e-06,"d":"0.00"},{"v":1.2e-06,"d":"0"},0,{"$f":"'JSM Eingabe+TW'!$K$18*3.6*24","v":0},{"v":1e-06,"d":"0"},{"v":1e-06,"d":"0"}," ",{"v":1e-06,"d":"0"}]
[null,"2002-10-31",304,{"$f":"'JSM Eingabe+TW'!DF62","v":{"v":1e-06,"d":"0"}},0,{"v":1e-06,"d":"0.00"},{"v":1.2e-06,"d":"0"},0,{"$f":"'JSM Eingabe+TW'!$K$18*3.6*24","v":0},{"v":1e-06,"d":"0"},{"v":1e-06,"d":"0"}," ",{"v":1e-06,"d":"0"}]
[null,"2002-11-01",305,{"$f":"'JSM Eingabe+TW'!DG32","v":{"v":1e-06,"d":"0"}},0,{"v":1e-06,"d":"0.00"},{"v":1.2e-06,"d":"0"},0,{"$f":"'JSM Eingabe+TW'!$K$18*3.6*24","v":0},{"v":1e-06,"d":"0"},{"v":1e-06,"d":"0"}," ",{"v":1e-06,"d":"0"}]
[null,"2002-11-02",306,{"$f":"'JSM Eingabe+TW'!DG33","v":{"v":1e-06,"d":"0"}},0,{"v":1e-06,"d":"0.00"},{"v":1.2e-06,"d":"0"},0,{"$f":"'JSM Eingabe+TW'!$K$18*3.6*24","v":0},{"v":1e-06,"d":"0"},{"v":1e-06,"d":"0"}," ",{"v":1e-06,"d":"0"}]
[null,"2002-11-03",307,{"$f":"'JSM Eingabe+TW'!DG34","v":{"v":1e-06,"d":"0"}},0,{"v":1e-06,"d":"0.00"},{"v":1.2e-06,"d":"0"},0,{"$f":"'JSM Eingabe+TW'!$K$18*3.6*24","v":0},{"v":1e-06,"d":"0"},{"v":1e-06,"d":"0"}," ",{"v":1e-06,"d":"0"}]
[null,"2002-11-04",308,{"$f":"'JSM Eingabe+TW'!DG35","v":{"v":1e-06,"d":"0"}},0,{"v":1e-06,"d":"0.00"},{"v":1.2e-06,"d":"0"},0,{"$f":"'JSM Eingabe+TW'!$K$18*3.6*24","v":0},{"v":1e-06,"d":"0"},{"v":1e-06,"d":"0"}," ",{"v":1e-06,"d":"0"}]
[null,"2002-11-05",309,{"$f":"'JSM Eingabe+TW'!DG36","v":{"v":1e-06,"d":"0"}},0,{"v":1e-06,"d":"0.00"},{"v":1.2e-06,"d":"0"},0,{"$f":"'JSM Eingabe+TW'!$K$18*3.6*24","v":0},{"v":1e-06,"d":"0"},{"v":1e-06,"d":"0"}," ",{"v":1e-06,"d":"0"}]
[null,"2002-11-06",310,{"$f":"'JSM Eingabe+TW'!DG37","v":{"v":1e-06,"d":"0"}},0,{"v":1e-06,"d":"0.00"},{"v":1.2e-06,"d":"0"},0,{"$f":"'JSM Eingabe+TW'!$K$18*3.6*24","v":0},{"v":1e-06,"d":"0"},{"v":1e-06,"d":"0"}," ",{"v":1e-06,"d":"0"}]
[null,"2002-11-07",311,{"$f":"'JSM Eingabe+TW'!DG38","v":{"v":1e-06,"d":"0"}},0,{"v":1e-06,"d":"0.00"},{"v":1.2e-06,"d":"0"},0,{"$f":"'JSM Eingabe+TW'!$K$18*3.6*24","v":0},{"v":1e-06,"d":"0"},{"v":1e-06,"d":"0"}," ",{"v":1e-06,"d":"0"}]
[null,"2002-11-08",312,{"$f":"'JSM Eingabe+TW'!DG39","v":{"v":1e-06,"d":"0"}},0,{"v":1e-06,"d":"0.00"},{"v":1.2e-06,"d":"0"},0,{"$f":"'JSM Eingabe+TW'!$K$18*3.6*24","v":0},{"v":1e-06,"d":"0"},{"v":1e-06,"d":"0"}," ",{"v":1e-06,"d":"0"}]
[null,"2002-11-09",313,{"$f":"'JSM Eingabe+TW'!DG40","v":{"v":1e-06,"d":"0"}},0,{"v":1e-06,"d":"0.00"},{"v":1.2e-06,"d":"0"},0,{"$f":"'JSM Eingabe+TW'!$K$18*3.6*24","v":0},{"v":1e-06,"d":"0"},{"v":1e-06,"d":"0"}," ",{"v":1e-06,"d":"0"}]
[null,"2002-11-10",314,{"$f":"'JSM Eingabe+TW'!DG41","v":{"v":1e-06,"d":"0"}},0,{"v":1e-06,"d":"0.00"},{"v":1.2e-06,"d":"0"},0,{"$f":"'JSM Eingabe+TW'!$K$18*3.6*24","v":0},{"v":1e-06,"d":"0"},{"v":1e-06,"d":"0"}," ",{"v":1e-06,"d":"0"}]
[null,"2002-11-11",315,{"$f":"'JSM Eingabe+TW'!DG42","v":{"v":1e-06,"d":"0"}},0,{"v":1e-06,"d":"0.00"},{"v":1.2e-06,"d":"0"},0,{"$f":"'JSM Eingabe+TW'!$K$18*3.6*24","v":0},{"v":1e-06,"d":"0"},{"v":1e-06,"d":"0"}," ",{"v":1e-06,"d":"0"}]
[null,"2002-11-12",316,{"$f":"'JSM Eingabe+TW'!DG43","v":{"v":1e-06,"d":"0"}},0,{"v":1e-06,"d":"0.00"},{"v":1.2e-06,"d":"0"},0,{"$f":"'JSM Eingabe+TW'!$K$18*3.6*24","v":0},{"v":1e-06,"d":"0"},{"v":1e-06,"d":"0"}," ",{"v":1e-06,"d":"0"}]
[null,"2002-11-13",317,{"$f":"'JSM Eingabe+TW'!DG44","v":{"v":1e-06,"d":"0"}},0,{"v":1e-06,"d":"0.00"},{"v":1.2e-06,"d":"0"},0,{"$f":"'JSM Eingabe+TW'!$K$18*3.6*24","v":0},{"v":1e-06,"d":"0"},{"v":1e-06,"d":"0"}," ",{"v":1e-06,"d":"0"}]
[null,"2002-11-14",318,{"$f":"'JSM Eingabe+TW'!DG45","v":{"v":1e-06,"d":"0"}},0,{"v":1e-06,"d":"0.00"},{"v":1.2e-06,"d":"0"},0,{"$f":"'JSM Eingabe+TW'!$K$18*3.6*24","v":0},{"v":1e-06,"d":"0"},{"v":1e-06,"d":"0"}," ",{"v":1e-06,"d":"0"}]
[null,"2002-11-15",319,{"$f":"'JSM Eingabe+TW'!DG46","v":{"v":1e-06,"d":"0"}},0,{"v":1e-06,"d":"0.00"},{"v":1.2e-06,"d":"0"},0,{"$f":"'JSM Eingabe+TW'!$K$18*3.6*24","v":0},{"v":1e-06,"d":"0"},{"v":1e-06,"d":"0"}," ",{"v":1e-06,"d":"0"}]
[null,"2002-11-16",320,{"$f":"'JSM Eingabe+TW'!DG47","v":{"v":1e-06,"d":"0"}},0,{"v":1e-06,"d":"0.00"},{"v":1.2e-06,"d":"0"},0,{"$f":"'JSM Eingabe+TW'!$K$18*3.6*24","v":0},{"v":1e-06,"d":"0"},{"v":1e-06,"d":"0"}," ",{"v":1e-06,"d":"0"}]
[null,"2002-11-17",321,{"$f":"'JSM Eingabe+TW'!DG48","v":{"v":1e-06,"d":"0"}},0,{"v":1e-06,"d":"0.00"},{"v":1.2e-06,"d":"0"},0,{"$f":"'JSM Eingabe+TW'!$K$18*3.6*24","v":0},{"$f":"IF(D375<=G375,D375,0)","v":{"v":1e-06,"d":"0"}},{"$f":"IF(F375<E375,0,F375-E375)","v":{"v":1e-06,"d":"0"}},{"$f":"IF(M375<0,1, \" \")","v":" "},{"$f":"F375-E375","v":{"v":1e-06,"d":"0"}}]
[null,"2002-11-18",322,{"$f":"'JSM Eingabe+TW'!DG49","v":{"v":1e-06,"d":"0"}},{"$f":"$E$55","v":0},{"v":1e-06,"d":"0.00"},{"$f":"F376*1.2","v":{"v":1.2e-06,"d":"0"}},0,{"$f":"'JSM Eingabe+TW'!$K$18*3.6*24","v":0},{"v":1e-06,"d":"0"},{"v":1e-06,"d":"0"}," ",{"v":1e-06,"d":"0"}]
[null,"2002-11-19",323,{"$f":"'JSM Eingabe+TW'!DG50","v":{"v":1e-06,"d":"0"}},0,{"v":1e-06,"d":"0.00"},{"v":1.2e-06,"d":"0"},{"$f":"H376","v":0},{"$f":"'JSM Eingabe+TW'!$K$18*3.6*24","v":0},{"v":1e-06,"d":"0"},{"v":1e-06,"d":"0"}," ",{"v":1e-06,"d":"0"}]
[null,"2002-11-20",324,{"$f":"'JSM Eingabe+TW'!DG51","v":{"v":1e-06,"d":"0"}},0,{"v":1e-06,"d":"0.00"},{"v":1.2e-06,"d":"0"},0,{"$f":"'JSM Eingabe+TW'!$K$18*3.6*24","v":0},{"v":1e-06,"d":"0"},{"v":1e-06,"d":"0"}," ",{"v":1e-06,"d":"0"}]
[null,"2002-11-21",325,{"$f":"'JSM Eingabe+TW'!DG52","v":{"v":1e-06,"d":"0"}},0,{"v":1e-06,"d":"0.00"},{"v":1.2e-06,"d":"0"},0,{"$f":"'JSM Eingabe+TW'!$K$18*3.6*24","v":0},{"v":1e-06,"d":"0"},{"v":1e-06,"d":"0"}," ",{"v":1e-06,"d":"0"}]
[null,"2002-11-22",326,{"$f":"'JSM Eingabe+TW'!DG53","v":{"v":1e-06,"d":"0"}},0,{"v":1e-06,"d":"0.00"},{"v":1.2e-06,"d":"0"},0,{"$f":"'JSM Eingabe+TW'!$K$18*3.6*24","v":0},{"v":1e-06,"d":"0"},{"v":1e-06,"d":"0"}," ",{"v":1e-06,"d":"0"}]
[null,"2002-11-23",327,{"$f":"'JSM Eingabe+TW'!DG54","v":{"v":1e-06,"d":"0"}},0,{"v":1e-06,"d":"0.00"},{"v":1.2e-06,"d":"0"},0,{"$f":"'JSM Eingabe+TW'!$K$18*3.6*24","v":0},{"v":1e-06,"d":"0"},{"v":1e-06,"d":"0"}," ",{"v":1e-06,"d":"0"}]
[null,"2002-11-24",328,{"$f":"'JSM Eingabe+TW'!DG55","v":{"v":1e-06,"d":"0"}},0,{"v":1e-06,"d":"0.00"},{"v":1.2e-06,"d":"0"},0,{"$f":"'JSM Eingabe+TW'!$K$18*3.6*24","v":0},{"v":1e-06,"d":"0"},{"v":1e-06,"d":"0"}," ",{"v":1e-06,"d":"0"}]
[null,"2002-11-25",329,{"$f":"'JSM Eingabe+TW'!DG56","v":{"v":1e-06,"d":"0"}},0,{"v":1e-06,"d":"0.00"},{"v":1.2e-06,"d":"0"},0,{"$f":"'JSM Eingabe+TW'!$K$18*3.6*24","v":0},{"v":1e-06,"d":"0"},{"v":1e-06,"d":"0"}," ",{"v":1e-06,"d":"0"}]
[null,"2002-11-26",330,{"$f":"'JSM Eingabe+TW'!DG57","v":{"v":1e-06,"d":"0"}},0,{"v":1e-06,"d":"0.00"},{"v":1.2e-06,"d":"0"},0,{"$f":"'JSM Eingabe+TW'!$K$18*3.6*24","v":0},{"v":1e-06,"d":"0"},{"v":1e-06,"d":"0"}," ",{"v":1e-06,"d":"0"}]
[null,"2002-11-27",331,{"$f":"'JSM Eingabe+TW'!DG58","v":{"v":1e-06,"d":"0"}},0,{"v":1e-06,"d":"0.00"},{"v":1.2e-06,"d":"0"},0,{"$f":"'JSM Eingabe+TW'!$K$18*3.6*24","v":0},{"v":1e-06,"d":"0"},{"v":1e-06,"d":"0"}," ",{"v":1e-06,"d":"0"}]
[null,"2002-11-28",332,{"$f":"'JSM Eingabe+TW'!DG59","v":{"v":1e-06,"d":"0"}},0,{"$f":"SMALL(D376:D396,1)","v":{"v":1e-06,"d":"0.00"}},{"v":1.2e-06,"d":"0"},0,{"$f":"'JSM Eingabe+TW'!$K$18*3.6*24","v":0},{"v":1e-06,"d":"0"},{"v":1e-06,"d":"0"}," ",{"v":1e-06,"d":"0"}]
[null,"2002-11-29",333,{"$f":"'JSM Eingabe+TW'!DG60","v":{"v":1e-06,"d":"0"}},0,{"v":1e-06,"d":"0.00"},{"v":1.2e-06,"d":"0"},0,{"$f":"'JSM Eingabe+TW'!$K$18*3.6*24","v":0},{"v":1e-06,"d":"0"},{"v":1e-06,"d":"0"}," ",{"v":1e-06,"d":"0"}]
[null,"2002-11-30",334,{"$f":"'JSM Eingabe+TW'!DG61","v":{"v":1e-06,"d":"0"}},0,{"v":1e-06,"d":"0.00"},{"v":1.2e-06,"d":"0"},0,{"$f":"'JSM Eingabe+TW'!$K$18*3.6*24","v":0},{"v":1e-06,"d":"0"},{"v":1e-06,"d":"0"}," ",{"v":1e-06,"d":"0"}]
[null,"2002-12-01",335,{"$f":"'JSM Eingabe+TW'!DH32","v":{"v":1e-06,"d":"0"}},0,{"v":1e-06,"d":"0.00"},{"v":1.2e-06,"d":"0"},0,{"$f":"'JSM Eingabe+TW'!$K$18*3.6*24","v":0},{"v":1e-06,"d":"0"},{"v":1e-06,"d":"0"}," ",{"v":1e-06,"d":"0"}]
[null,"2002-12-02",336,{"$f":"'JSM Eingabe+TW'!DH33","v":{"v":1e-06,"d":"0"}},0,{"v":1e-06,"d":"0.00"},{"v":1.2e-06,"d":"0"},0,{"$f":"'JSM Eingabe+TW'!$K$18*3.6*24","v":0},{"v":1e-06,"d":"0"},{"v":1e-06,"d":"0"}," ",{"v":1e-06,"d":"0"}]
[null,"2002-12-03",337,{"$f":"'JSM Eingabe+TW'!DH34","v":{"v":1e-06,"d":"0"}},0,{"v":1e-06,"d":"0.00"},{"v":1.2e-06,"d":"0"},0,{"$f":"'JSM Eingabe+TW'!$K$18*3.6*24","v":0},{"v":1e-06,"d":"0"},{"v":1e-06,"d":"0"}," ",{"v":1e-06,"d":"0"}]
[null,"2002-12-04",338,{"$f":"'JSM Eingabe+TW'!DH35","v":{"v":1e-06,"d":"0"}},0,{"v":1e-06,"d":"0.00"},{"v":1.2e-06,"d":"0"},0,{"$f":"'JSM Eingabe+TW'!$K$18*3.6*24","v":0},{"v":1e-06,"d":"0"},{"v":1e-06,"d":"0"}," ",{"v":1e-06,"d":"0"}]
[null,"2002-12-05",339,{"$f":"'JSM Eingabe+TW'!DH36","v":{"v":1e-06,"d":"0"}},0,{"v":1e-06,"d":"0.00"},{"v":1.2e-06,"d":"0"},0,{"$f":"'JSM Eingabe+TW'!$K$18*3.6*24","v":0},{"v":1e-06,"d":"0"},{"v":1e-06,"d":"0"}," ",{"v":1e-06,"d":"0"}]
[null,"2002-12-06",340,{"$f":"'JSM Eingabe+TW'!DH37","v":{"v":1e-06,"d":"0"}},0,{"v":1e-06,"d":"0.00"},{"v":1.2e-06,"d":"0"},0,{"$f":"'JSM Eingabe+TW'!$K$18*3.6*24","v":0},{"v":1e-06,"d":"0"},{"v":1e-06,"d":"0"}," ",{"v":1e-06,"d":"0"}]
[null,"2002-12-07",341,{"$f":"'JSM Eingabe+TW'!DH38","v":{"v":1e-06,"d":"0"}},0,{"v":1e-06,"d":"0.00"},{"v":1.2e-06,"d":"0"},0,{"$f":"'JSM Eingabe+TW'!$K$18*3.6*24","v":0},{"v":1e-06,"d":"0"},{"v":1e-06,"d":"0"}," ",{"v":1e-06,"d":"0"}]
[null,"2002-12-08",342,{"$f":"'JSM Eingabe+TW'!DH39","v":{"v":1e-06,"d":"0"}},0,{"v":1e-06,"d":"0.00"},{"v":1.2e-06,"d":"0"},0,{"$f":"'JSM Eingabe+TW'!$K$18*3.6*24","v":0},{"v":1e-06,"d":"0"},{"v":1e-06,"d":"0"}," ",{"v":1e-06,"d":"0"}]
[null,"2002-12-09",343,{"$f":"'JSM Eingabe+TW'!DH40","v":{"v":1e-06,"d":"0"}},0,{"v":1e-06,"d":"0.00"},{"v":1.2e-06,"d":"0"},0,{"$f":"'JSM Eingabe+TW'!$K$18*3.6*24","v":0},{"v":1e-06,"d":"0"},{"v":1e-06,"d":"0"}," ",{"v":1e-06,"d":"0"}]
[null,"2002-12-10",344,{"$f":"'JSM Eingabe+TW'!DH41","v":{"v":1e-06,"d":"0"}},0,{"v":1e-06,"d":"0.00"},{"v":1.2e-06,"d":"0"},0,{"$f":"'JSM Eingabe+TW'!$K$18*3.6*24","v":0},{"v":1e-06,"d":"0"},{"v":1e-06,"d":"0"}," ",{"v":1e-06,"d":"0"}]
[null,"2002-12-11",345,{"$f":"'JSM Eingabe+TW'!DH42","v":{"v":1e-06,"d":"0"}},0,{"v":1e-06,"d":"0.00"},{"v":1.2e-06,"d":"0"},0,{"$f":"'JSM Eingabe+TW'!$K$18*3.6*24","v":0},{"v":1e-06,"d":"0"},{"v":1e-06,"d":"0"}," ",{"v":1e-06,"d":"0"}]
[null,"2002-12-12",346,{"$f":"'JSM Eingabe+TW'!DH43","v":{"v":1e-06,"d":"0"}},0,{"v":1e-06,"d":"0.00"},{"v":1.2e-06,"d":"0"},0,{"$f":"'JSM Eingabe+TW'!$K$18*3.6*24","v":0},{"v":1e-06,"d":"0"},{"v":1e-06,"d":"0"}," ",{"v":1e-06,"d":"0"}]
[null,"2002-12-13",347,{"$f":"'JSM Eingabe+TW'!DH44","v":{"v":1e-06,"d":"0"}},0,{"v":1e-06,"d":"0.00"},{"v":1.2e-06,"d":"0"},0,{"$f":"'JSM Eingabe+TW'!$K$18*3.6*24","v":0},{"v":1e-06,"d":"0"},{"v":1e-06,"d":"0"}," ",{"v":1e-06,"d":"0"}]
[null,"2002-12-14",348,{"$f":"'JSM Eingabe+TW'!DH45","v":{"v":1e-06,"d":"0"}},0,{"v":1e-06,"d":"0.00"},{"v":1.2e-06,"d":"0"},0,{"$f":"'JSM Eingabe+TW'!$K$18*3.6*24","v":0},{"v":1e-06,"d":"0"},{"v":1e-06,"d":"0"}," ",{"v":1e-06,"d":"0"}]
[null,"2002-12-15",349,{"$f":"'JSM Eingabe+TW'!DH46","v":{"v":1e-06,"d":"0"}},0,{"v":1e-06,"d":"0.00"},{"v":1.2e-06,"d":"0"},0,{"$f":"'JSM Eingabe+TW'!$K$18*3.6*24","v":0},{"v":1e-06,"d":"0"},{"v":1e-06,"d":"0"}," ",{"v":1e-06,"d":"0"}]
[null,"2002-12-16",350,{"$f":"'JSM Eingabe+TW'!DH47","v":{"v":1e-06,"d":"0"}},0,{"v":1e-06,"d":"0.00"},{"v":1.2e-06,"d":"0"},0,{"$f":"'JSM Eingabe+TW'!$K$18*3.6*24","v":0},{"v":1e-06,"d":"0"},{"v":1e-06,"d":"0"}," ",{"v":1e-06,"d":"0"}]
[null,"2002-12-17",351,{"$f":"'JSM Eingabe+TW'!DH48","v":{"v":1e-06,"d":"0"}},0,{"v":1e-06,"d":"0.00"},{"v":1.2e-06,"d":"0"},0,{"$f":"'JSM Eingabe+TW'!$K$18*3.6*24","v":0},{"v":1e-06,"d":"0"},{"v":1e-06,"d":"0"}," ",{"v":1e-06,"d":"0"}]
[null,"2002-12-18",352,{"$f":"'JSM Eingabe+TW'!DH49","v":{"v":1e-06,"d":"0"}},0,{"v":1e-06,"d":"0.00"},{"v":1.2e-06,"d":"0"},0,{"$f":"'JSM Eingabe+TW'!$K$18*3.6*24","v":0},{"v":1e-06,"d":"0"},{"v":1e-06,"d":"0"}," ",{"v":1e-06,"d":"0"}]
[null,"2002-12-19",353,{"$f":"'JSM Eingabe+TW'!DH50","v":{"v":1e-06,"d":"0"}},0,{"v":1e-06,"d":"0.00"},{"v":1.2e-06,"d":"0"},0,{"$f":"'JSM Eingabe+TW'!$K$18*3.6*24","v":0},{"v":1e-06,"d":"0"},{"v":1e-06,"d":"0"}," ",{"v":1e-06,"d":"0"}]
[null,"2002-12-20",354,{"$f":"'JSM Eingabe+TW'!DH51","v":{"v":1e-06,"d":"0"}},0,{"v":1e-06,"d":"0.00"},{"v":1.2e-06,"d":"0"},0,{"$f":"'JSM Eingabe+TW'!$K$18*3.6*24","v":0},{"v":1e-06,"d":"0"},{"v":1e-06,"d":"0"}," ",{"v":1e-06,"d":"0"}]
[null,"2002-12-21",355,{"$f":"'JSM Eingabe+TW'!DH52","v":{"v":1e-06,"d":"0"}},0,{"v":1e-06,"d":"0.00"},{"v":1.2e-06,"d":"0"},0,{"$f":"'JSM Eingabe+TW'!$K$18*3.6*24","v":0},{"v":1e-06,"d":"0"},{"v":1e-06,"d":"0"}," ",{"v":1e-06,"d":"0"}]
[null,"2002-12-22",356,{"$f":"'JSM Eingabe+TW'!DH53","v":{"v":1e-06,"d":"0"}},0,{"v":1e-06,"d":"0.00"},{"v":1.2e-06,"d":"0"},0,{"$f":"'JSM Eingabe+TW'!$K$18*3.6*24","v":0},{"v":1e-06,"d":"0"},{"v":1e-06,"d":"0"}," ",{"v":1e-06,"d":"0"}]
[null,"2002-12-23",357,{"$f":"'JSM Eingabe+TW'!DH54","v":{"v":1e-06,"d":"0"}},0,{"v":1e-06,"d":"0.00"},{"v":1.2e-06,"d":"0"},0,{"$f":"'JSM Eingabe+TW'!$K$18*3.6*24","v":0},{"v":1e-06,"d":"0"},{"v":1e-06,"d":"0"}," ",{"v":1e-06,"d":"0"}]
[null,"2002-12-24",358,{"$f":"'JSM Eingabe+TW'!DH55","v":{"v":1e-06,"d":"0"}},0,{"v":1e-06,"d":"0.00"},{"v":1.2e-06,"d":"0"},0,{"$f":"'JSM Eingabe+TW'!$K$18*3.6*24","v":0},{"v":1e-06,"d":"0"},{"v":1e-06,"d":"0"}," ",{"v":1e-06,"d":"0"}]
[null,"2002-12-25",359,{"$f":"'JSM Eingabe+TW'!DH56","v":{"v":1e-06,"d":"0"}},0,{"v":1e-06,"d":"0.00"},{"v":1.2e-06,"d":"0"},0,{"$f":"'JSM Eingabe+TW'!$K$18*3.6*24","v":0},{"v":1e-06,"d":"0"},{"v":1e-06,"d":"0"}," ",{"v":1e-06,"d":"0"}]
[null,"2002-12-26",360,{"$f":"'JSM Eingabe+TW'!DH57","v":{"v":1e-06,"d":"0"}},0,{"v":1e-06,"d":"0.00"},{"v":1.2e-06,"d":"0"},0,{"$f":"'JSM Eingabe+TW'!$K$18*3.6*24","v":0},{"v":1e-06,"d":"0"},{"v":1e-06,"d":"0"}," ",{"v":1e-06,"d":"0"}]
[null,"2002-12-27",361,{"$f":"'JSM Eingabe+TW'!DH58","v":{"v":1e-06,"d":"0"}},0,{"v":1e-06,"d":"0.00"},{"v":1.2e-06,"d":"0"},0,{"$f":"'JSM Eingabe+TW'!$K$18*3.6*24","v":0},{"v":1e-06,"d":"0"},{"v":1e-06,"d":"0"}," ",{"v":1e-06,"d":"0"}]
[null,"2002-12-28",362,{"$f":"'JSM Eingabe+TW'!DH59","v":{"v":1e-06,"d":"0"}},0,{"v":1e-06,"d":"0.00"},{"v":1.2e-06,"d":"0"},0,{"$f":"'JSM Eingabe+TW'!$K$18*3.6*24","v":0},{"v":1e-06,"d":"0"},{"v":1e-06,"d":"0"}," ",{"v":1e-06,"d":"0"}]
[null,"2002-12-29",363,{"$f":"'JSM Eingabe+TW'!DH60","v":{"v":1e-06,"d":"0"}},0,{"v":1e-06,"d":"0.00"},{"v":1.2e-06,"d":"0"},0,{"$f":"'JSM Eingabe+TW'!$K$18*3.6*24","v":0},{"v":1e-06,"d":"0"},{"v":1e-06,"d":"0"}," ",{"v":1e-06,"d":"0"}]
[null,"2002-12-30",364,{"$f":"'JSM Eingabe+TW'!DH61","v":{"v":1e-06,"d":"0"}},0,{"v":1e-06,"d":"0.00"},{"v":1.2e-06,"d":"0"},0,{"$f":"'JSM Eingabe+TW'!$K$18*3.6*24","v":0},{"v":1e-06,"d":"0"},{"v":1e-06,"d":"0"}," ",{"v":1e-06,"d":"0"}]
[null,"2002-12-31",365,{"$f":"'JSM Eingabe+TW'!DH62","v":{"v":1e-06,"d":"0"}},0,{"v":1e-06,"d":"0.00"},{"v":1.2e-06,"d":"0"},0,{"$f":"'JSM Eingabe+TW'!$K$18*3.6*24","v":0},{"v":1e-06,"d":"0"},{"v":1e-06,"d":"0"}," ",{"v":1e-06,"d":"0"}]
[{"$nulls":3},{"$f":"SUM(D55:D419)","v":{"v":3.6500000000000237E-4,"d":"0"}},{"$f":"SUM(E55:E419)","v":0},{"$f":"SUM(F55:F419)","v":{"v":3.6500000000000237E-4,"d":"0"}},{"$f":"SUM(G55:G419)","v":{"v":4.3799999999999628E-4,"d":"0"}},{"$nulls":3},{"$f":"SUM(K55:K419)","v":{"v":3.6500000000000237E-4,"d":"0"}}," ",{"$f":"SUM(M55:M419)","v":{"v":3.6500000000000237E-4,"d":"0"}}]
[]
[{"$nulls":9},{"$f":"SUM(J55:J419)","v":{"v":3.6500000000000237E-4,"d":"0"}}]
[{"$nulls":9},{"$f":"COUNTIF(J55:J419,\">0\")","v":365},"  =Anzahl der zu berücksichtigenden Messungen nach A 198"]
[{"$nulls":9},{"$f":"J422/J423*365","v":{"v":3.6500000000000237E-4,"d":"0 "}},"  = JSM nach A 198: alle gemessenen Werte, die gleich oder unterhalb des um 20 % erhöhten gleitenden Minimum- Polygon liegen."]

{"sheet":"JSM Jahresdauerlinie","index":13,"n_rows":385,"n_cols":25,"rows_kept":385,"merged":[[11,3,13,3],[11,4,13,5],[16,1,16,3],[17,1,17,3],[19,1,19,3],[20,1,20,3],[21,1,21,3],[22,2,22,3],[24,1,24,3],[25,1,25,3],[27,1,27,3],[28,1,28,3],[29,1,29,3],[30,1,30,3],[33,13,33,15]]}
[]
[null,{"$f":"'JSM Eingabe+TW'!B2","v":"Ergebnisse der Selbstüberwachung"},{"$nulls":13},"Berichtsjahr :",{"$f":"IF(LEN('JSM Eingabe+TW'!AB7)>0,'JSM Eingabe+TW'!AB7,\"\")","v":""}]
[]
[]
[null,{"$f":"'JSM Eingabe+TW'!B5","v":"Ermittlung der Jahresschmutzwassermenge (JSM) und des Fremdwassers (QF)"},{"$nulls":14},"Blatt 3"]
[]
[null,"Kläranlage :",{"$f":"IF(LEN('JSM Eingabe+TW'!D7)>0,'JSM Eingabe+TW'!D7,\"\")","v":""},{"$nulls":4},"VG / Stadt:  ",{"$f":"IF(LEN('JSM Eingabe+TW'!M7)>0,'JSM Eingabe+TW'!M7,\"\")","v":""},{"$nulls":7},{"$f":"'JSM Eingabe+TW'!AB2","v":"Programmversion 7.3.9"}]
[]
[null,"JSM über die Jahresdauerlinie"]
[]
[]
[{"$nulls":3},"INFO- Feld mit dem Mauszeiger anfahren","INFO",{"$nulls":17},{"$f":"E30*2","v":0}]
[{"$nulls":21},{"$f":"ROUND(E30,0)","v":0},{"$f":"ROUND(W12,0)","v":0},null,{"$f":"COUNTIF(Y18:Y382,\">1\")","v":0}]
[]
[]
[]
[null,"ausgewertete Betriebsdaten:",{"$nulls":18},"Menge"]
[null,"mittlerer Tageswert des Jahres",null,null,{"$f":"'JSM Eingabe+TW'!I102","v":""},"m³/d",{"$nulls":12},365,1,{"$f":"LARGE('JSM Eingabe+TW'!$DJ$32:$DU$62,S18)","v":1e-06},{"$f":"IF(T18=V$13,LARGE(U$18:U$382,1),0)","v":0},{"$f":"IF(T18=W$13,LARGE(U$18:U$382,1),0)","v":0},null,{"$f":"IF(U18>'JSM Eingabe+TW'!$CU$92,'JSM Eingabe+TW'!$CU$92,\" \")","v":" "}]
[{"$nulls":3},"Kleinstwert",{"$f":"'JSM Eingabe+TW'!M102","v":""},"m³/d",{"$nulls":12},364,2,{"$f":"LARGE('JSM Eingabe+TW'!$DJ$32:$DU$62,S19)","v":1e-06},0,0,{"$f":"E$31","v":0},{"$f":"IF(U19>'JSM Eingabe+TW'!$CU$92,'JSM Eingabe+TW'!$CU$92,\" \")","v":" "}]
[null,"Mittelwert (ohne Hochwasser)",null,null,{"$f":"'JSM Eingabe+TW'!Q102","v":""},"m³/d",{"$nulls":12},363,3,{"$f":"LARGE('JSM Eingabe+TW'!$DJ$32:$DU$62,S20)","v":1e-06},0,0,null,{"$f":"IF(U20>'JSM Eingabe+TW'!$CU$92,'JSM Eingabe+TW'!$CU$92,\" \")","v":" "}]
[null,"größtes Trockenwetter (TW):",null,null,{"$f":"'JSM Eingabe+TW'!I103","v":""},"m³/d",{"$nulls":12},362,4,{"$f":"LARGE('JSM Eingabe+TW'!$DJ$32:$DU$62,S21)","v":1e-06},0,0,null,{"$f":"IF(U21>'JSM Eingabe+TW'!$CU$92,'JSM Eingabe+TW'!$CU$92,\" \")","v":" "}]
[null,"kleinstes TW:",null,null,{"$f":"'JSM Eingabe+TW'!M103","v":""},"m³/d",{"$nulls":12},361,5,{"$f":"LARGE('JSM Eingabe+TW'!$DJ$32:$DU$62,S22)","v":1e-06},0,0,null,{"$f":"IF(U22>'JSM Eingabe+TW'!$CU$92,'JSM Eingabe+TW'!$CU$92,\" \")","v":" "}]
[null,null,"mittleres TW:",null,{"$f":"'JSM Eingabe+TW'!Q103","v":{"v":1e-06,"d":"0"}},"m³/d",{"$nulls":12},360,6,{"$f":"LARGE('JSM Eingabe+TW'!$DJ$32:$DU$62,S23)","v":1e-06},0,0,null,{"$f":"IF(U23>'JSM Eingabe+TW'!$CU$92,'JSM Eingabe+TW'!$CU$92,\" \")","v":" "}]
[{"$nulls":18},359,7,{"$f":"LARGE('JSM Eingabe+TW'!$DJ$32:$DU$62,S24)","v":1e-06},0,0,{"$f":"E$31","v":0},{"$f":"IF(U24>'JSM Eingabe+TW'!$CU$92,'JSM Eingabe+TW'!$CU$92,\" \")","v":" "}]
[null,"Anzahl fehlender Einträge / Hochwassertage",null,null,{"$f":"'JSM Eingabe+TW'!N104","v":365},"d",{"$nulls":12},358,8,{"$f":"LARGE('JSM Eingabe+TW'!$DJ$32:$DU$62,S25)","v":1e-06},0,0,null,{"$f":"IF(U25>'JSM Eingabe+TW'!$CU$92,'JSM Eingabe+TW'!$CU$92,\" \")","v":" "}]
[null,{"$f":"IF('JSM Eingabe+TW'!DX18>0,\"Für fehlende Einträge und für Hochwassertage wird folgender Ersatzwert berücksichtigt:\",\" \")","v":"Für fehlende Einträge und für Hochwassertage wird folgender Ersatzwert berücksichtigt:"},null,null,{"$f":"IF('JSM Eingabe+TW'!DX18>0,'JSM Eingabe+TW'!Q103,\" \")","v":{"v":1e-06,"d":"0 "}},{"$f":"IF('JSM Eingabe+TW'!DX18>0,\"m³/d\",\" \")","v":"m³/d"},{"$nulls":12},357,9,{"$f":"LARGE('JSM Eingabe+TW'!$DJ$32:$DU$62,S26)","v":1e-06},0,0,null,{"$f":"IF(U26>'JSM Eingabe+TW'!$CU$92,'JSM Eingabe+TW'!$CU$92,\" \")","v":" "}]
[{"$nulls":18},356,10,{"$f":"LARGE('JSM Eingabe+TW'!$DJ$32:$DU$62,S27)","v":1e-06},0,0,null,{"$f":"IF(U27>'JSM Eingabe+TW'!$CU$92,'JSM Eingabe+TW'!$CU$92,\" \")","v":" "}]
[null,"Auswertung der Jahresdauerlinie:",{"$nulls":16},355,11,{"$f":"LARGE('JSM Eingabe+TW'!$DJ$32:$DU$62,S28)","v":1e-06},0,0,null,{"$f":"IF(U28>'JSM Eingabe+TW'!$CU$92,'JSM Eingabe+TW'!$CU$92,\" \")","v":" "}]
[null,"Anzahl der TW-Tage nach Betriebstagebuch",null,null,{"$f":"'JSM Eingabe+TW'!AB64","v":0},"d","(bis zur gelben Linie)",{"$nulls":11},354,12,{"$f":"LARGE('JSM Eingabe+TW'!$DJ$32:$DU$62,S29)","v":1e-06},0,0,{"$f":"E$31","v":0},{"$f":"IF(U29>'JSM Eingabe+TW'!$CU$92,'JSM Eingabe+TW'!$CU$92,\" \")","v":" "}]
[null,"Hälfte der Anzahl der TW-Tage",null,null,{"$f":"E29/2","v":{"v":0,"d":"0.0"}},"d","(rote Linie)",{"$nulls":11},353,13,{"$f":"LARGE('JSM Eingabe+TW'!$DJ$32:$DU$62,S30)","v":1e-06},0,0,null,{"$f":"IF(U30>'JSM Eingabe+TW'!$CU$92,'JSM Eingabe+TW'!$CU$92,\" \")","v":" "}]
[null,"Errechneter mittlerer Abfluß bei TW",null,null,{"$f":"IFERROR(VLOOKUP(V13,T18:U382,2,1),0)","v":0},"m³/d","(blau strichliert)",{"$nulls":11},352,14,{"$f":"LARGE('JSM Eingabe+TW'!$DJ$32:$DU$62,S31)","v":1e-06},0,0,null,{"$f":"IF(U31>'JSM Eingabe+TW'!$CU$92,'JSM Eingabe+TW'!$CU$92,\" \")","v":" "}]
[{"$nulls":18},351,15,{"$f":"LARGE('JSM Eingabe+TW'!$DJ$32:$DU$62,S32)","v":1e-06},0,0,null,{"$f":"IF(U32>'JSM Eingabe+TW'!$CU$92,'JSM Eingabe+TW'!$CU$92,\" \")","v":" "}]
[{"$nulls":7},"ERGEBNIS:",{"$nulls":10},350,16,{"$f":"LARGE('JSM Eingabe+TW'!$DJ$32:$DU$62,S33)","v":1e-06},0,0,null,{"$f":"IF(U33>'JSM Eingabe+TW'!$CU$92,'JSM Eingabe+TW'!$CU$92,\" \")","v":" "}]
[{"$nulls":9},"Jahresschmutzwassermenge",{"$nulls":3},{"$f":"E31*365","v":0},null,null,"m³",null,349,17,{"$f":"LARGE('JSM Eingabe+TW'!$DJ$32:$DU$62,S34)","v":1e-06},0,0,{"$f":"E$31","v":0}]
[{"$nulls":18},348,18,{"$f":"LARGE('JSM Eingabe+TW'!$DJ$32:$DU$62,S35)","v":1e-06},0,0]
[{"$nulls":18},347,19,{"$f":"LARGE('JSM Eingabe+TW'!$DJ$32:$DU$62,S36)","v":1e-06},0,0]
[{"$nulls":18},346,20,{"$f":"LARGE('JSM Eingabe+TW'!$DJ$32:$DU$62,S37)","v":1e-06},0,0]
[{"$nulls":18},345,21,{"$f":"LARGE('JSM Eingabe+TW'!$DJ$32:$DU$62,S38)","v":1e-06},0,0,null,{"$f":"IF(U38>'JSM Eingabe+TW'!$CU$92,'JSM Eingabe+TW'!$CU$92,\" \")","v":" "}]
[{"$nulls":18},344,22,{"$f":"LARGE('JSM Eingabe+TW'!$DJ$32:$DU$62,S39)","v":1e-06},0,0,{"$f":"E$31","v":0}]
[{"$nulls":18},343,23,{"$f":"LARGE('JSM Eingabe+TW'!$DJ$32:$DU$62,S40)","v":1e-06},0,0]
[{"$nulls":9},{"$f":"IF(Y13>0,\"Der schwarz liniierte Bereich am rechten Rand liegt ausserhalb des Betrachtungsbereichs (fehlende Daten)\",\" \")","v":" "},{"$nulls":8},342,24,{"$f":"LARGE('JSM Eingabe+TW'!$DJ$32:$DU$62,S41)","v":1e-06},0,0,null,{"$f":"IF(U41>'JSM Eingabe+TW'!$CU$92,'JSM Eingabe+TW'!$CU$92,\" \")","v":" "}]
[{"$nulls":18},341,25,{"$f":"LARGE('JSM Eingabe+TW'!$DJ$32:$DU$62,S42)","v":1e-06},0,0,null,{"$f":"IF(U42>'JSM Eingabe+TW'!$CU$92,'JSM Eingabe+TW'!$CU$92,\" \")","v":" "}]
[{"$nulls":18},340,26,{"$f":"LARGE('JSM Eingabe+TW'!$DJ$32:$DU$62,S43)","v":1e-06},0,0,null,{"$f":"IF(U43>'JSM Eingabe+TW'!$CU$92,'JSM Eingabe+TW'!$CU$92,\" \")","v":" "}]
[{"$nulls":18},339,27,{"$f":"LARGE('JSM Eingabe+TW'!$DJ$32:$DU$62,S44)","v":1e-06},0,0,{"$f":"E$31","v":0},{"$f":"IF(U44>'JSM Eingabe+TW'!$CU$92,'JSM Eingabe+TW'!$CU$92,\" \")","v":" "}]
[{"$nulls":18},338,28,{"$f":"LARGE('JSM Eingabe+TW'!$DJ$32:$DU$62,S45)","v":1e-06},0,0,null,{"$f":"IF(U45>'JSM Eingabe+TW'!$CU$92,'JSM Eingabe+TW'!$CU$92,\" \")","v":" "}]
[{"$nulls":18},337,29,{"$f":"LARGE('JSM Eingabe+TW'!$DJ$32:$DU$62,S46)","v":1e-06},0,0,null,{"$f":"IF(U46>'JSM Eingabe+TW'!$CU$92,'JSM Eingabe+TW'!$CU$92,\" \")","v":" "}]
[{"$nulls":18},336,30,{"$f":"LARGE('JSM Eingabe+TW'!$DJ$32:$DU$62,S47)","v":1e-06},0,0,null,{"$f":"IF(U47>'JSM Eingabe+TW'!$CU$92,'JSM Eingabe+TW'!$CU$92,\" \")","v":" "}]
[{"$nulls":18},335,31,{"$f":"LARGE('JSM Eingabe+TW'!$DJ$32:$DU$62,S48)","v":1e-06},0,0,null,{"$f":"IF(U48>'JSM Eingabe+TW'!$CU$92,'JSM Eingabe+TW'!$CU$92,\" \")","v":" "}]
[{"$nulls":18},334,32,{"$f":"LARGE('JSM Eingabe+TW'!$DJ$32:$DU$62,S49)","v":1e-06},0,0,{"$f":"E$31","v":0},{"$f":"IF(U49>'JSM Eingabe+TW'!$CU$92,'JSM Eingabe+TW'!$CU$92,\" \")","v":" "}]
[{"$nulls":18},333,33,{"$f":"LARGE('JSM Eingabe+TW'!$DJ$32:$DU$62,S50)","v":1e-06},0,0,null,{"$f":"IF(U50>'JSM Eingabe+TW'!$CU$92,'JSM Eingabe+TW'!$CU$92,\" \")","v":" "}]
[{"$nulls":18},332,34,{"$f":"LARGE('JSM Eingabe+TW'!$DJ$32:$DU$62,S51)","v":1e-06},0,0,null,{"$f":"IF(U51>'JSM Eingabe+TW'!$CU$92,'JSM Eingabe+TW'!$CU$92,\" \")","v":" "}]
[{"$nulls":18},331,35,{"$f":"LARGE('JSM Eingabe+TW'!$DJ$32:$DU$62,S52)","v":1e-06},0,0,null,{"$f":"IF(U52>'JSM Eingabe+TW'!$CU$92,'JSM Eingabe+TW'!$CU$92,\" \")","v":" "}]
[{"$nulls":18},330,36,{"$f":"LARGE('JSM Eingabe+TW'!$DJ$32:$DU$62,S53)","v":1e-06},0,0,null,{"$f":"IF(U53>'JSM Eingabe+TW'!$CU$92,'JSM Eingabe+TW'!$CU$92,\" \")","v":" "}]
[{"$nulls":18},329,37,{"$f":"LARGE('JSM Eingabe+TW'!$DJ$32:$DU$62,S54)","v":1e-06},0,0,{"$f":"E$31","v":0},{"$f":"IF(U54>'JSM Eingabe+TW'!$CU$92,'JSM Eingabe+TW'!$CU$92,\" \")","v":" "}]
[{"$nulls":18},328,38,{"$f":"LARGE('JSM Eingabe+TW'!$DJ$32:$DU$62,S55)","v":1e-06},0,0,null,{"$f":"IF(U55>'JSM Eingabe+TW'!$CU$92,'JSM Eingabe+TW'!$CU$92,\" \")","v":" "}]
[{"$nulls":18},327,39,{"$f":"LARGE('JSM Eingabe+TW'!$DJ$32:$DU$62,S56)","v":1e-06},0,0,null,{"$f":"IF(U56>'JSM Eingabe+TW'!$CU$92,'JSM Eingabe+TW'!$CU$92,\" \")","v":" "}]
[{"$nulls":18},326,40,{"$f":"LARGE('JSM Eingabe+TW'!$DJ$32:$DU$62,S57)","v":1e-06},0,0,null,{"$f":"IF(U57>'JSM Eingabe+TW'!$CU$92,'JSM Eingabe+TW'!$CU$92,\" \")","v":" "}]
[{"$nulls":18},325,41,{"$f":"LARGE('JSM Eingabe+TW'!$DJ$32:$DU$62,S58)","v":1e-06},0,0,null,{"$f":"IF(U58>'JSM Eingabe+TW'!$CU$92,'JSM Eingabe+TW'!$CU$92,\" \")","v":" "}]
[{"$nulls":18},324,42,{"$f":"LARGE('JSM Eingabe+TW'!$DJ$32:$DU$62,S59)","v":1e-06},0,0,{"$f":"E$31","v":0},{"$f":"IF(U59>'JSM Eingabe+TW'!$CU$92,'JSM Eingabe+TW'!$CU$92,\" \")","v":" "}]
[{"$nulls":18},323,43,{"$f":"LARGE('JSM Eingabe+TW'!$DJ$32:$DU$62,S60)","v":1e-06},0,0,null,{"$f":"IF(U60>'JSM Eingabe+TW'!$CU$92,'JSM Eingabe+TW'!$CU$92,\" \")","v":" "}]
[{"$nulls":18},322,44,{"$f":"LARGE('JSM Eingabe+TW'!$DJ$32:$DU$62,S61)","v":1e-06},0,0,null,{"$f":"IF(U61>'JSM Eingabe+TW'!$CU$92,'JSM Eingabe+TW'!$CU$92,\" \")","v":" "}]
[{"$nulls":18},321,45,{"$f":"LARGE('JSM Eingabe+TW'!$DJ$32:$DU$62,S62)","v":1e-06},0,0,null,{"$f":"IF(U62>'JSM Eingabe+TW'!$CU$92,'JSM Eingabe+TW'!$CU$92,\" \")","v":" "}]
[{"$nulls":18},320,46,{"$f":"LARGE('JSM Eingabe+TW'!$DJ$32:$DU$62,S63)","v":1e-06},0,0,null,{"$f":"IF(U63>'JSM Eingabe+TW'!$CU$92,'JSM Eingabe+TW'!$CU$92,\" \")","v":" "}]
[{"$nulls":18},319,47,{"$f":"LARGE('JSM Eingabe+TW'!$DJ$32:$DU$62,S64)","v":1e-06},0,0,{"$f":"E$31","v":0},{"$f":"IF(U64>'JSM Eingabe+TW'!$CU$92,'JSM Eingabe+TW'!$CU$92,\" \")","v":" "}]
[{"$nulls":18},318,48,{"$f":"LARGE('JSM Eingabe+TW'!$DJ$32:$DU$62,S65)","v":1e-06},0,0,null,{"$f":"IF(U65>'JSM Eingabe+TW'!$CU$92,'JSM Eingabe+TW'!$CU$92,\" \")","v":" "}]
[{"$nulls":18},317,49,{"$f":"LARGE('JSM Eingabe+TW'!$DJ$32:$DU$62,S66)","v":1e-06},0,0,null,{"$f":"IF(U66>'JSM Eingabe+TW'!$CU$92,'JSM Eingabe+TW'!$CU$92,\" \")","v":" "}]
[{"$nulls":18},316,50,{"$f":"LARGE('JSM Eingabe+TW'!$DJ$32:$DU$62,S67)","v":1e-06},0,0,null,{"$f":"IF(U67>'JSM Eingabe+TW'!$CU$92,'JSM Eingabe+TW'!$CU$92,\" \")","v":" "}]
[{"$nulls":18},315,51,{"$f":"LARGE('JSM Eingabe+TW'!$DJ$32:$DU$62,S68)","v":1e-06},0,0,null,{"$f":"IF(U68>'JSM Eingabe+TW'!$CU$92,'JSM Eingabe+TW'!$CU$92,\" \")","v":" "}]
[{"$nulls":18},314,52,{"$f":"LARGE('JSM Eingabe+TW'!$DJ$32:$DU$62,S69)","v":1e-06},0,0,{"$f":"E$31","v":0},{"$f":"IF(U69>'JSM Eingabe+TW'!$CU$92,'JSM Eingabe+TW'!$CU$92,\" \")","v":" "}]
[{"$nulls":18},313,53,{"$f":"LARGE('JSM Eingabe+TW'!$DJ$32:$DU$62,S70)","v":1e-06},0,0,null,{"$f":"IF(U70>'JSM Eingabe+TW'!$CU$92,'JSM Eingabe+TW'!$CU$92,\" \")","v":" "}]
[{"$nulls":18},312,54,{"$f":"LARGE('JSM Eingabe+TW'!$DJ$32:$DU$62,S71)","v":1e-06},0,0,null,{"$f":"IF(U71>'JSM Eingabe+TW'!$CU$92,'JSM Eingabe+TW'!$CU$92,\" \")","v":" "}]
[{"$nulls":18},311,55,{"$f":"LARGE('JSM Eingabe+TW'!$DJ$32:$DU$62,S72)","v":1e-06},0,0,null,{"$f":"IF(U72>'JSM Eingabe+TW'!$CU$92,'JSM Eingabe+TW'!$CU$92,\" \")","v":" "}]
[{"$nulls":18},310,56,{"$f":"LARGE('JSM Eingabe+TW'!$DJ$32:$DU$62,S73)","v":1e-06},0,0,null,{"$f":"IF(U73>'JSM Eingabe+TW'!$CU$92,'JSM Eingabe+TW'!$CU$92,\" \")","v":" "}]
[{"$nulls":18},309,57,{"$f":"LARGE('JSM Eingabe+TW'!$DJ$32:$DU$62,S74)","v":1e-06},0,0,{"$f":"E$31","v":0},{"$f":"IF(U74>'JSM Eingabe+TW'!$CU$92,'JSM Eingabe+TW'!$CU$92,\" \")","v":" "}]
[{"$nulls":18},308,58,{"$f":"LARGE('JSM Eingabe+TW'!$DJ$32:$DU$62,S75)","v":1e-06},0,0,null,{"$f":"IF(U75>'JSM Eingabe+TW'!$CU$92,'JSM Eingabe+TW'!$CU$92,\" \")","v":" "}]
[{"$nulls":18},307,59,{"$f":"LARGE('JSM Eingabe+TW'!$DJ$32:$DU$62,S76)","v":1e-06},0,0,null,{"$f":"IF(U76>'JSM Eingabe+TW'!$CU$92,'JSM Eingabe+TW'!$CU$92,\" \")","v":" "}]
[{"$nulls":18},306,60,{"$f":"LARGE('JSM Eingabe+TW'!$DJ$32:$DU$62,S77)","v":1e-06},0,0,null,{"$f":"IF(U77>'JSM Eingabe+TW'!$CU$92,'JSM Eingabe+TW'!$CU$92,\" \")","v":" "}]
[{"$nulls":18},305,61,{"$f":"LARGE('JSM Eingabe+TW'!$DJ$32:$DU$62,S78)","v":1e-06},0,0,null,{"$f":"IF(U78>'JSM Eingabe+TW'!$CU$92,'JSM Eingabe+TW'!$CU$92,\" \")","v":" "}]
[{"$nulls":18},304,62,{"$f":"LARGE('JSM Eingabe+TW'!$DJ$32:$DU$62,S79)","v":1e-06},0,0,{"$f":"E$31","v":0},{"$f":"IF(U79>'JSM Eingabe+TW'!$CU$92,'JSM Eingabe+TW'!$CU$92,\" \")","v":" "}]
[{"$nulls":18},303,63,{"$f":"LARGE('JSM Eingabe+TW'!$DJ$32:$DU$62,S80)","v":1e-06},0,0,null,{"$f":"IF(U80>'JSM Eingabe+TW'!$CU$92,'JSM Eingabe+TW'!$CU$92,\" \")","v":" "}]
[{"$nulls":18},302,64,{"$f":"LARGE('JSM Eingabe+TW'!$DJ$32:$DU$62,S81)","v":1e-06},0,0,null,{"$f":"IF(U81>'JSM Eingabe+TW'!$CU$92,'JSM Eingabe+TW'!$CU$92,\" \")","v":" "}]
[{"$nulls":18},301,65,{"$f":"LARGE('JSM Eingabe+TW'!$DJ$32:$DU$62,S82)","v":1e-06},{"$f":"IF(T82=V$13,LARGE(U$18:U$382,1),0)","v":0},{"$f":"IF(T82=W$13,LARGE(U$18:U$382,1),0)","v":0},null,{"$f":"IF(U82>'JSM Eingabe+TW'!$CU$92,'JSM Eingabe+TW'!$CU$92,\" \")","v":" "}]
[{"$nulls":18},300,66,{"$f":"LARGE('JSM Eingabe+TW'!$DJ$32:$DU$62,S83)","v":1e-06},0,0,null,{"$f":"IF(U83>'JSM Eingabe+TW'!$CU$92,'JSM Eingabe+TW'!$CU$92,\" \")","v":" "}]
[{"$nulls":18},299,67,{"$f":"LARGE('JSM Eingabe+TW'!$DJ$32:$DU$62,S84)","v":1e-06},0,0,{"$f":"E$31","v":0},{"$f":"IF(U84>'JSM Eingabe+TW'!$CU$92,'JSM Eingabe+TW'!$CU$92,\" \")","v":" "}]
[{"$nulls":18},298,68,{"$f":"LARGE('JSM Eingabe+TW'!$DJ$32:$DU$62,S85)","v":1e-06},0,0,null,{"$f":"IF(U85>'JSM Eingabe+TW'!$CU$92,'JSM Eingabe+TW'!$CU$92,\" \")","v":" "}]
[{"$nulls":18},297,69,{"$f":"LARGE('JSM Eingabe+TW'!$DJ$32:$DU$62,S86)","v":1e-06},0,0,null,{"$f":"IF(U86>'JSM Eingabe+TW'!$CU$92,'JSM Eingabe+TW'!$CU$92,\" \")","v":" "}]
[{"$nulls":18},296,70,{"$f":"LARGE('JSM Eingabe+TW'!$DJ$32:$DU$62,S87)","v":1e-06},0,0,null,{"$f":"IF(U87>'JSM Eingabe+TW'!$CU$92,'JSM Eingabe+TW'!$CU$92,\" \")","v":" "}]
[{"$nulls":18},295,71,{"$f":"LARGE('JSM Eingabe+TW'!$DJ$32:$DU$62,S88)","v":1e-06},0,0,null,{"$f":"IF(U88>'JSM Eingabe+TW'!$CU$92,'JSM Eingabe+TW'!$CU$92,\" \")","v":" "}]
[{"$nulls":18},294,72,{"$f":"LARGE('JSM Eingabe+TW'!$DJ$32:$DU$62,S89)","v":1e-06},0,0,{"$f":"E$31","v":0},{"$f":"IF(U89>'JSM Eingabe+TW'!$CU$92,'JSM Eingabe+TW'!$CU$92,\" \")","v":" "}]
[{"$nulls":18},293,73,{"$f":"LARGE('JSM Eingabe+TW'!$DJ$32:$DU$62,S90)","v":1e-06},0,0,null,{"$f":"IF(U90>'JSM Eingabe+TW'!$CU$92,'JSM Eingabe+TW'!$CU$92,\" \")","v":" "}]
[{"$nulls":18},292,74,{"$f":"LARGE('JSM Eingabe+TW'!$DJ$32:$DU$62,S91)","v":1e-06},0,0,null,{"$f":"IF(U91>'JSM Eingabe+TW'!$CU$92,'JSM Eingabe+TW'!$CU$92,\" \")","v":" "}]
[{"$nulls":18},291,75,{"$f":"LARGE('JSM Eingabe+TW'!$DJ$32:$DU$62,S92)","v":1e-06},0,0,null,{"$f":"IF(U92>'JSM Eingabe+TW'!$CU$92,'JSM Eingabe+TW'!$CU$92,\" \")","v":" "}]
[{"$nulls":18},290,76,{"$f":"LARGE('JSM Eingabe+TW'!$DJ$32:$DU$62,S93)","v":1e-06},0,0,null,{"$f":"IF(U93>'JSM Eingabe+TW'!$CU$92,'JSM Eingabe+TW'!$CU$92,\" \")","v":" "}]
[{"$nulls":18},289,77,{"$f":"LARGE('JSM Eingabe+TW'!$DJ$32:$DU$62,S94)","v":1e-06},0,0,{"$f":"E$31","v":0},{"$f":"IF(U94>'JSM Eingabe+TW'!$CU$92,'JSM Eingabe+TW'!$CU$92,\" \")","v":" "}]
[{"$nulls":18},288,78,{"$f":"LARGE('JSM Eingabe+TW'!$DJ$32:$DU$62,S95)","v":1e-06},0,0,null,{"$f":"IF(U95>'JSM Eingabe+TW'!$CU$92,'JSM Eingabe+TW'!$CU$92,\" \")","v":" "}]
[{"$nulls":18},287,79,{"$f":"LARGE('JSM Eingabe+TW'!$DJ$32:$DU$62,S96)","v":1e-06},0,0,null,{"$f":"IF(U96>'JSM Eingabe+TW'!$CU$92,'JSM Eingabe+TW'!$CU$92,\" \")","v":" "}]
[{"$nulls":18},286,80,{"$f":"LARGE('JSM Eingabe+TW'!$DJ$32:$DU$62,S97)","v":1e-06},0,0,null,{"$f":"IF(U97>'JSM Eingabe+TW'!$CU$92,'JSM Eingabe+TW'!$CU$92,\" \")","v":" "}]
[{"$nulls":18},285,81,{"$f":"LARGE('JSM Eingabe+TW'!$DJ$32:$DU$62,S98)","v":1e-06},0,0,null,{"$f":"IF(U98>'JSM Eingabe+TW'!$CU$92,'JSM Eingabe+TW'!$CU$92,\" \")","v":" "}]
[{"$nulls":18},284,82,{"$f":"LARGE('JSM Eingabe+TW'!$DJ$32:$DU$62,S99)","v":1e-06},0,0,{"$f":"E$31","v":0},{"$f":"IF(U99>'JSM Eingabe+TW'!$CU$92,'JSM Eingabe+TW'!$CU$92,\" \")","v":" "}]
[{"$nulls":18},283,83,{"$f":"LARGE('JSM Eingabe+TW'!$DJ$32:$DU$62,S100)","v":1e-06},0,0,null,{"$f":"IF(U100>'JSM Eingabe+TW'!$CU$92,'JSM Eingabe+TW'!$CU$92,\" \")","v":" "}]
[{"$nulls":18},282,84,{"$f":"LARGE('JSM Eingabe+TW'!$DJ$32:$DU$62,S101)","v":1e-06},0,0,null,{"$f":"IF(U101>'JSM Eingabe+TW'!$CU$92,'JSM Eingabe+TW'!$CU$92,\" \")","v":" "}]
[{"$nulls":18},281,85,{"$f":"LARGE('JSM Eingabe+TW'!$DJ$32:$DU$62,S102)","v":1e-06},0,0,null,{"$f":"IF(U102>'JSM Eingabe+TW'!$CU$92,'JSM Eingabe+TW'!$CU$92,\" \")","v":" "}]
[{"$nulls":18},280,86,{"$f":"LARGE('JSM Eingabe+TW'!$DJ$32:$DU$62,S103)","v":1e-06},0,0,null,{"$f":"IF(U103>'JSM Eingabe+TW'!$CU$92,'JSM Eingabe+TW'!$CU$92,\" \")","v":" "}]
[{"$nulls":18},279,87,{"$f":"LARGE('JSM Eingabe+TW'!$DJ$32:$DU$62,S104)","v":1e-06},0,0,{"$f":"E$31","v":0},{"$f":"IF(U104>'JSM Eingabe+TW'!$CU$92,'JSM Eingabe+TW'!$CU$92,\" \")","v":" "}]
[{"$nulls":18},278,88,{"$f":"LARGE('JSM Eingabe+TW'!$DJ$32:$DU$62,S105)","v":1e-06},0,0,null,{"$f":"IF(U105>'JSM Eingabe+TW'!$CU$92,'JSM Eingabe+TW'!$CU$92,\" \")","v":" "}]
[{"$nulls":18},277,89,{"$f":"LARGE('JSM Eingabe+TW'!$DJ$32:$DU$62,S106)","v":1e-06},0,0,null,{"$f":"IF(U106>'JSM Eingabe+TW'!$CU$92,'JSM Eingabe+TW'!$CU$92,\" \")","v":" "}]
[{"$nulls":18},276,90,{"$f":"LARGE('JSM Eingabe+TW'!$DJ$32:$DU$62,S107)","v":1e-06},0,0,null,{"$f":"IF(U107>'JSM Eingabe+TW'!$CU$92,'JSM Eingabe+TW'!$CU$92,\" \")","v":" "}]
[{"$nulls":18},275,91,{"$f":"LARGE('JSM Eingabe+TW'!$DJ$32:$DU$62,S108)","v":1e-06},0,0,null,{"$f":"IF(U108>'JSM Eingabe+TW'!$CU$92,'JSM Eingabe+TW'!$CU$92,\" \")","v":" "}]
[{"$nulls":18},274,92,{"$f":"LARGE('JSM Eingabe+TW'!$DJ$32:$DU$62,S109)","v":1e-06},0,0,{"$f":"E$31","v":0},{"$f":"IF(U109>'JSM Eingabe+TW'!$CU$92,'JSM Eingabe+TW'!$CU$92,\" \")","v":" "}]
[{"$nulls":18},273,93,{"$f":"LARGE('JSM Eingabe+TW'!$DJ$32:$DU$62,S110)","v":1e-06},0,0,null,{"$f":"IF(U110>'JSM Eingabe+TW'!$CU$92,'JSM Eingabe+TW'!$CU$92,\" \")","v":" "}]
[{"$nulls":18},272,94,{"$f":"LARGE('JSM Eingabe+TW'!$DJ$32:$DU$62,S111)","v":1e-06},0,0,null,{"$f":"IF(U111>'JSM Eingabe+TW'!$CU$92,'JSM Eingabe+TW'!$CU$92,\" \")","v":" "}]
[{"$nulls":18},271,95,{"$f":"LARGE('JSM Eingabe+TW'!$DJ$32:$DU$62,S112)","v":1e-06},0,0,null,{"$f":"IF(U112>'JSM Eingabe+TW'!$CU$92,'JSM Eingabe+TW'!$CU$92,\" \")","v":" "}]
[{"$nulls":18},270,96,{"$f":"LARGE('JSM Eingabe+TW'!$DJ$32:$DU$62,S113)","v":1e-06},0,0,null,{"$f":"IF(U113>'JSM Eingabe+TW'!$CU$92,'JSM Eingabe+TW'!$CU$92,\" \")","v":" "}]
[{"$nulls":18},269,97,{"$f":"LARGE('JSM Eingabe+TW'!$DJ$32:$DU$62,S114)","v":1e-06},0,0,{"$f":"E$31","v":0},{"$f":"IF(U114>'JSM Eingabe+TW'!$CU$92,'JSM Eingabe+TW'!$CU$92,\" \")","v":" "}]
[{"$nulls":18},268,98,{"$f":"LARGE('JSM Eingabe+TW'!$DJ$32:$DU$62,S115)","v":1e-06},0,0,null,{"$f":"IF(U115>'JSM Eingabe+TW'!$CU$92,'JSM Eingabe+TW'!$CU$92,\" \")","v":" "}]
[{"$nulls":18},267,99,{"$f":"LARGE('JSM Eingabe+TW'!$DJ$32:$DU$62,S116)","v":1e-06},0,0,null,{"$f":"IF(U116>'JSM Eingabe+TW'!$CU$92,'JSM Eingabe+TW'!$CU$92,\" \")","v":" "}]
[{"$nulls":18},266,100,{"$f":"LARGE('JSM Eingabe+TW'!$DJ$32:$DU$62,S117)","v":1e-06},0,0,null,{"$f":"IF(U117>'JSM Eingabe+TW'!$CU$92,'JSM Eingabe+TW'!$CU$92,\" \")","v":" "}]
[{"$nulls":18},265,101,{"$f":"LARGE('JSM Eingabe+TW'!$DJ$32:$DU$62,S118)","v":1e-06},0,0,null,{"$f":"IF(U118>'JSM Eingabe+TW'!$CU$92,'JSM Eingabe+TW'!$CU$92,\" \")","v":" "}]
[{"$nulls":18},264,102,{"$f":"LARGE('JSM Eingabe+TW'!$DJ$32:$DU$62,S119)","v":1e-06},0,0,{"$f":"E$31","v":0},{"$f":"IF(U119>'JSM Eingabe+TW'!$CU$92,'JSM Eingabe+TW'!$CU$92,\" \")","v":" "}]
[{"$nulls":18},263,103,{"$f":"LARGE('JSM Eingabe+TW'!$DJ$32:$DU$62,S120)","v":1e-06},0,0,null,{"$f":"IF(U120>'JSM Eingabe+TW'!$CU$92,'JSM Eingabe+TW'!$CU$92,\" \")","v":" "}]
[{"$nulls":18},262,104,{"$f":"LARGE('JSM Eingabe+TW'!$DJ$32:$DU$62,S121)","v":1e-06},0,0,null,{"$f":"IF(U121>'JSM Eingabe+TW'!$CU$92,'JSM Eingabe+TW'!$CU$92,\" \")","v":" "}]
[{"$nulls":18},261,105,{"$f":"LARGE('JSM Eingabe+TW'!$DJ$32:$DU$62,S122)","v":1e-06},0,0,null,{"$f":"IF(U122>'JSM Eingabe+TW'!$CU$92,'JSM Eingabe+TW'!$CU$92,\" \")","v":" "}]
[{"$nulls":18},260,106,{"$f":"LARGE('JSM Eingabe+TW'!$DJ$32:$DU$62,S123)","v":1e-06},0,0,null,{"$f":"IF(U123>'JSM Eingabe+TW'!$CU$92,'JSM Eingabe+TW'!$CU$92,\" \")","v":" "}]
[{"$nulls":18},259,107,{"$f":"LARGE('JSM Eingabe+TW'!$DJ$32:$DU$62,S124)","v":1e-06},0,0,{"$f":"E$31","v":0},{"$f":"IF(U124>'JSM Eingabe+TW'!$CU$92,'JSM Eingabe+TW'!$CU$92,\" \")","v":" "}]
[{"$nulls":18},258,108,{"$f":"LARGE('JSM Eingabe+TW'!$DJ$32:$DU$62,S125)","v":1e-06},0,0,null,{"$f":"IF(U125>'JSM Eingabe+TW'!$CU$92,'JSM Eingabe+TW'!$CU$92,\" \")","v":" "}]
[{"$nulls":18},257,109,{"$f":"LARGE('JSM Eingabe+TW'!$DJ$32:$DU$62,S126)","v":1e-06},0,0,null,{"$f":"IF(U126>'JSM Eingabe+TW'!$CU$92,'JSM Eingabe+TW'!$CU$92,\" \")","v":" "}]
[{"$nulls":18},256,110,{"$f":"LARGE('JSM Eingabe+TW'!$DJ$32:$DU$62,S127)","v":1e-06},0,0,null,{"$f":"IF(U127>'JSM Eingabe+TW'!$CU$92,'JSM Eingabe+TW'!$CU$92,\" \")","v":" "}]
[{"$nulls":18},255,111,{"$f":"LARGE('JSM Eingabe+TW'!$DJ$32:$DU$62,S128)","v":1e-06},0,0,null,{"$f":"IF(U128>'JSM Eingabe+TW'!$CU$92,'JSM Eingabe+TW'!$CU$92,\" \")","v":" "}]
[{"$nulls":18},254,112,{"$f":"LARGE('JSM Eingabe+TW'!$DJ$32:$DU$62,S129)","v":1e-06},0,0,{"$f":"E$31","v":0},{"$f":"IF(U129>'JSM Eingabe+TW'!$CU$92,'JSM Eingabe+TW'!$CU$92,\" \")","v":" "}]
[{"$nulls":18},253,113,{"$f":"LARGE('JSM Eingabe+TW'!$DJ$32:$DU$62,S130)","v":1e-06},0,0,null,{"$f":"IF(U130>'JSM Eingabe+TW'!$CU$92,'JSM Eingabe+TW'!$CU$92,\" \")","v":" "}]
[{"$nulls":18},252,114,{"$f":"LARGE('JSM Eingabe+TW'!$DJ$32:$DU$62,S131)","v":1e-06},0,0,null,{"$f":"IF(U131>'JSM Eingabe+TW'!$CU$92,'JSM Eingabe+TW'!$CU$92,\" \")","v":" "}]
[{"$nulls":18},251,115,{"$f":"LARGE('JSM Eingabe+TW'!$DJ$32:$DU$62,S132)","v":1e-06},0,0,null,{"$f":"IF(U132>'JSM Eingabe+TW'!$CU$92,'JSM Eingabe+TW'!$CU$92,\" \")","v":" "}]
[{"$nulls":18},250,116,{"$f":"LARGE('JSM Eingabe+TW'!$DJ$32:$DU$62,S133)","v":1e-06},0,0,null,{"$f":"IF(U133>'JSM Eingabe+TW'!$CU$92,'JSM Eingabe+TW'!$CU$92,\" \")","v":" "}]
[{"$nulls":18},249,117,{"$f":"LARGE('JSM Eingabe+TW'!$DJ$32:$DU$62,S134)","v":1e-06},0,0,{"$f":"E$31","v":0},{"$f":"IF(U134>'JSM Eingabe+TW'!$CU$92,'JSM Eingabe+TW'!$CU$92,\" \")","v":" "}]
[{"$nulls":18},248,118,{"$f":"LARGE('JSM Eingabe+TW'!$DJ$32:$DU$62,S135)","v":1e-06},0,0,null,{"$f":"IF(U135>'JSM Eingabe+TW'!$CU$92,'JSM Eingabe+TW'!$CU$92,\" \")","v":" "}]
[{"$nulls":18},247,119,{"$f":"LARGE('JSM Eingabe+TW'!$DJ$32:$DU$62,S136)","v":1e-06},0,0,null,{"$f":"IF(U136>'JSM Eingabe+TW'!$CU$92,'JSM Eingabe+TW'!$CU$92,\" \")","v":" "}]
[{"$nulls":18},246,120,{"$f":"LARGE('JSM Eingabe+TW'!$DJ$32:$DU$62,S137)","v":1e-06},0,0,null,{"$f":"IF(U137>'JSM Eingabe+TW'!$CU$92,'JSM Eingabe+TW'!$CU$92,\" \")","v":" "}]
[{"$nulls":18},245,121,{"$f":"LARGE('JSM Eingabe+TW'!$DJ$32:$DU$62,S138)","v":1e-06},0,0,null,{"$f":"IF(U138>'JSM Eingabe+TW'!$CU$92,'JSM Eingabe+TW'!$CU$92,\" \")","v":" "}]
[{"$nulls":18},244,122,{"$f":"LARGE('JSM Eingabe+TW'!$DJ$32:$DU$62,S139)","v":1e-06},0,0,{"$f":"E$31","v":0},{"$f":"IF(U139>'JSM Eingabe+TW'!$CU$92,'JSM Eingabe+TW'!$CU$92,\" \")","v":" "}]
[{"$nulls":18},243,123,{"$f":"LARGE('JSM Eingabe+TW'!$DJ$32:$DU$62,S140)","v":1e-06},0,0,null,{"$f":"IF(U140>'JSM Eingabe+TW'!$CU$92,'JSM Eingabe+TW'!$CU$92,\" \")","v":" "}]
[{"$nulls":18},242,124,{"$f":"LARGE('JSM Eingabe+TW'!$DJ$32:$DU$62,S141)","v":1e-06},0,0,null,{"$f":"IF(U141>'JSM Eingabe+TW'!$CU$92,'JSM Eingabe+TW'!$CU$92,\" \")","v":" "}]
[{"$nulls":18},241,125,{"$f":"LARGE('JSM Eingabe+TW'!$DJ$32:$DU$62,S142)","v":1e-06},0,0,null,{"$f":"IF(U142>'JSM Eingabe+TW'!$CU$92,'JSM Eingabe+TW'!$CU$92,\" \")","v":" "}]
[{"$nulls":18},240,126,{"$f":"LARGE('JSM Eingabe+TW'!$DJ$32:$DU$62,S143)","v":1e-06},0,0,null,{"$f":"IF(U143>'JSM Eingabe+TW'!$CU$92,'JSM Eingabe+TW'!$CU$92,\" \")","v":" "}]
[{"$nulls":18},239,127,{"$f":"LARGE('JSM Eingabe+TW'!$DJ$32:$DU$62,S144)","v":1e-06},0,0,{"$f":"E$31","v":0},{"$f":"IF(U144>'JSM Eingabe+TW'!$CU$92,'JSM Eingabe+TW'!$CU$92,\" \")","v":" "}]
[{"$nulls":18},238,128,{"$f":"LARGE('JSM Eingabe+TW'!$DJ$32:$DU$62,S145)","v":1e-06},0,0,null,{"$f":"IF(U145>'JSM Eingabe+TW'!$CU$92,'JSM Eingabe+TW'!$CU$92,\" \")","v":" "}]
[{"$nulls":18},237,129,{"$f":"LARGE('JSM Eingabe+TW'!$DJ$32:$DU$62,S146)","v":1e-06},{"$f":"IF(T146=V$13,LARGE(U$18:U$382,1),0)","v":0},{"$f":"IF(T146=W$13,LARGE(U$18:U$382,1),0)","v":0},null,{"$f":"IF(U146>'JSM Eingabe+TW'!$CU$92,'JSM Eingabe+TW'!$CU$92,\" \")","v":" "}]
[{"$nulls":18},236,130,{"$f":"LARGE('JSM Eingabe+TW'!$DJ$32:$DU$62,S147)","v":1e-06},0,0,null,{"$f":"IF(U147>'JSM Eingabe+TW'!$CU$92,'JSM Eingabe+TW'!$CU$92,\" \")","v":" "}]
[{"$nulls":18},235,131,{"$f":"LARGE('JSM Eingabe+TW'!$DJ$32:$DU$62,S148)","v":1e-06},0,0,null,{"$f":"IF(U148>'JSM Eingabe+TW'!$CU$92,'JSM Eingabe+TW'!$CU$92,\" \")","v":" "}]
[{"$nulls":18},234,132,{"$f":"LARGE('JSM Eingabe+TW'!$DJ$32:$DU$62,S149)","v":1e-06},0,0,{"$f":"E$31","v":0},{"$f":"IF(U149>'JSM Eingabe+TW'!$CU$92,'JSM Eingabe+TW'!$CU$92,\" \")","v":" "}]
[{"$nulls":18},233,133,{"$f":"LARGE('JSM Eingabe+TW'!$DJ$32:$DU$62,S150)","v":1e-06},0,0,null,{"$f":"IF(U150>'JSM Eingabe+TW'!$CU$92,'JSM Eingabe+TW'!$CU$92,\" \")","v":" "}]
[{"$nulls":18},232,134,{"$f":"LARGE('JSM Eingabe+TW'!$DJ$32:$DU$62,S151)","v":1e-06},0,0,null,{"$f":"IF(U151>'JSM Eingabe+TW'!$CU$92,'JSM Eingabe+TW'!$CU$92,\" \")","v":" "}]
[{"$nulls":18},231,135,{"$f":"LARGE('JSM Eingabe+TW'!$DJ$32:$DU$62,S152)","v":1e-06},0,0,null,{"$f":"IF(U152>'JSM Eingabe+TW'!$CU$92,'JSM Eingabe+TW'!$CU$92,\" \")","v":" "}]
[{"$nulls":18},230,136,{"$f":"LARGE('JSM Eingabe+TW'!$DJ$32:$DU$62,S153)","v":1e-06},0,0,null,{"$f":"IF(U153>'JSM Eingabe+TW'!$CU$92,'JSM Eingabe+TW'!$CU$92,\" \")","v":" "}]
[{"$nulls":18},229,137,{"$f":"LARGE('JSM Eingabe+TW'!$DJ$32:$DU$62,S154)","v":1e-06},0,0,{"$f":"E$31","v":0},{"$f":"IF(U154>'JSM Eingabe+TW'!$CU$92,'JSM Eingabe+TW'!$CU$92,\" \")","v":" "}]
[{"$nulls":18},228,138,{"$f":"LARGE('JSM Eingabe+TW'!$DJ$32:$DU$62,S155)","v":1e-06},0,0,null,{"$f":"IF(U155>'JSM Eingabe+TW'!$CU$92,'JSM Eingabe+TW'!$CU$92,\" \")","v":" "}]
[{"$nulls":18},227,139,{"$f":"LARGE('JSM Eingabe+TW'!$DJ$32:$DU$62,S156)","v":1e-06},0,0,null,{"$f":"IF(U156>'JSM Eingabe+TW'!$CU$92,'JSM Eingabe+TW'!$CU$92,\" \")","v":" "}]
[{"$nulls":18},226,140,{"$f":"LARGE('JSM Eingabe+TW'!$DJ$32:$DU$62,S157)","v":1e-06},0,0,null,{"$f":"IF(U157>'JSM Eingabe+TW'!$CU$92,'JSM Eingabe+TW'!$CU$92,\" \")","v":" "}]
[{"$nulls":18},225,141,{"$f":"LARGE('JSM Eingabe+TW'!$DJ$32:$DU$62,S158)","v":1e-06},0,0,null,{"$f":"IF(U158>'JSM Eingabe+TW'!$CU$92,'JSM Eingabe+TW'!$CU$92,\" \")","v":" "}]
[{"$nulls":18},224,142,{"$f":"LARGE('JSM Eingabe+TW'!$DJ$32:$DU$62,S159)","v":1e-06},0,0,{"$f":"E$31","v":0},{"$f":"IF(U159>'JSM Eingabe+TW'!$CU$92,'JSM Eingabe+TW'!$CU$92,\" \")","v":" "}]
[{"$nulls":18},223,143,{"$f":"LARGE('JSM Eingabe+TW'!$DJ$32:$DU$62,S160)","v":1e-06},0,0,null,{"$f":"IF(U160>'JSM Eingabe+TW'!$CU$92,'JSM Eingabe+TW'!$CU$92,\" \")","v":" "}]
[{"$nulls":18},222,144,{"$f":"LARGE('JSM Eingabe+TW'!$DJ$32:$DU$62,S161)","v":1e-06},0,0,null,{"$f":"IF(U161>'JSM Eingabe+TW'!$CU$92,'JSM Eingabe+TW'!$CU$92,\" \")","v":" "}]
[{"$nulls":18},221,145,{"$f":"LARGE('JSM Eingabe+TW'!$DJ$32:$DU$62,S162)","v":1e-06},0,0,null,{"$f":"IF(U162>'JSM Eingabe+TW'!$CU$92,'JSM Eingabe+TW'!$CU$92,\" \")","v":" "}]
[{"$nulls":18},220,146,{"$f":"LARGE('JSM Eingabe+TW'!$DJ$32:$DU$62,S163)","v":1e-06},0,0,null,{"$f":"IF(U163>'JSM Eingabe+TW'!$CU$92,'JSM Eingabe+TW'!$CU$92,\" \")","v":" "}]
[{"$nulls":18},219,147,{"$f":"LARGE('JSM Eingabe+TW'!$DJ$32:$DU$62,S164)","v":1e-06},0,0,{"$f":"E$31","v":0},{"$f":"IF(U164>'JSM Eingabe+TW'!$CU$92,'JSM Eingabe+TW'!$CU$92,\" \")","v":" "}]
[{"$nulls":18},218,148,{"$f":"LARGE('JSM Eingabe+TW'!$DJ$32:$DU$62,S165)","v":1e-06},0,0,null,{"$f":"IF(U165>'JSM Eingabe+TW'!$CU$92,'JSM Eingabe+TW'!$CU$92,\" \")","v":" "}]
[{"$nulls":18},217,149,{"$f":"LARGE('JSM Eingabe+TW'!$DJ$32:$DU$62,S166)","v":1e-06},0,0,null,{"$f":"IF(U166>'JSM Eingabe+TW'!$CU$92,'JSM Eingabe+TW'!$CU$92,\" \")","v":" "}]
[{"$nulls":18},216,150,{"$f":"LARGE('JSM Eingabe+TW'!$DJ$32:$DU$62,S167)","v":1e-06},0,0,null,{"$f":"IF(U167>'JSM Eingabe+TW'!$CU$92,'JSM Eingabe+TW'!$CU$92,\" \")","v":" "}]
[{"$nulls":18},215,151,{"$f":"LARGE('JSM Eingabe+TW'!$DJ$32:$DU$62,S168)","v":1e-06},0,0,null,{"$f":"IF(U168>'JSM Eingabe+TW'!$CU$92,'JSM Eingabe+TW'!$CU$92,\" \")","v":" "}]
[{"$nulls":18},214,152,{"$f":"LARGE('JSM Eingabe+TW'!$DJ$32:$DU$62,S169)","v":1e-06},0,0,null,{"$f":"IF(U169>'JSM Eingabe+TW'!$CU$92,'JSM Eingabe+TW'!$CU$92,\" \")","v":" "}]
[{"$nulls":18},213,153,{"$f":"LARGE('JSM Eingabe+TW'!$DJ$32:$DU$62,S170)","v":1e-06},0,0,{"$f":"E$31","v":0},{"$f":"IF(U170>'JSM Eingabe+TW'!$CU$92,'JSM Eingabe+TW'!$CU$92,\" \")","v":" "}]
[{"$nulls":18},212,154,{"$f":"LARGE('JSM Eingabe+TW'!$DJ$32:$DU$62,S171)","v":1e-06},0,0,null,{"$f":"IF(U171>'JSM Eingabe+TW'!$CU$92,'JSM Eingabe+TW'!$CU$92,\" \")","v":" "}]
[{"$nulls":18},211,155,{"$f":"LARGE('JSM Eingabe+TW'!$DJ$32:$DU$62,S172)","v":1e-06},0,0,null,{"$f":"IF(U172>'JSM Eingabe+TW'!$CU$92,'JSM Eingabe+TW'!$CU$92,\" \")","v":" "}]
[{"$nulls":18},210,156,{"$f":"LARGE('JSM Eingabe+TW'!$DJ$32:$DU$62,S173)","v":1e-06},0,0,null,{"$f":"IF(U173>'JSM Eingabe+TW'!$CU$92,'JSM Eingabe+TW'!$CU$92,\" \")","v":" "}]
[{"$nulls":18},209,157,{"$f":"LARGE('JSM Eingabe+TW'!$DJ$32:$DU$62,S174)","v":1e-06},0,0,null,{"$f":"IF(U174>'JSM Eingabe+TW'!$CU$92,'JSM Eingabe+TW'!$CU$92,\" \")","v":" "}]
[{"$nulls":18},208,158,{"$f":"LARGE('JSM Eingabe+TW'!$DJ$32:$DU$62,S175)","v":1e-06},0,0,{"$f":"E$31","v":0},{"$f":"IF(U175>'JSM Eingabe+TW'!$CU$92,'JSM Eingabe+TW'!$CU$92,\" \")","v":" "}]
[{"$nulls":18},207,159,{"$f":"LARGE('JSM Eingabe+TW'!$DJ$32:$DU$62,S176)","v":1e-06},0,0,null,{"$f":"IF(U176>'JSM Eingabe+TW'!$CU$92,'JSM Eingabe+TW'!$CU$92,\" \")","v":" "}]
[{"$nulls":18},206,160,{"$f":"LARGE('JSM Eingabe+TW'!$DJ$32:$DU$62,S177)","v":1e-06},0,0,null,{"$f":"IF(U177>'JSM Eingabe+TW'!$CU$92,'JSM Eingabe+TW'!$CU$92,\" \")","v":" "}]
[{"$nulls":18},205,161,{"$f":"LARGE('JSM Eingabe+TW'!$DJ$32:$DU$62,S178)","v":1e-06},0,0,null,{"$f":"IF(U178>'JSM Eingabe+TW'!$CU$92,'JSM Eingabe+TW'!$CU$92,\" \")","v":" "}]
[{"$nulls":18},204,162,{"$f":"LARGE('JSM Eingabe+TW'!$DJ$32:$DU$62,S179)","v":1e-06},0,0,null,{"$f":"IF(U179>'JSM Eingabe+TW'!$CU$92,'JSM Eingabe+TW'!$CU$92,\" \")","v":" "}]
[{"$nulls":18},203,163,{"$f":"LARGE('JSM Eingabe+TW'!$DJ$32:$DU$62,S180)","v":1e-06},0,0,{"$f":"E$31","v":0},{"$f":"IF(U180>'JSM Eingabe+TW'!$CU$92,'JSM Eingabe+TW'!$CU$92,\" \")","v":" "}]
[{"$nulls":18},202,164,{"$f":"LARGE('JSM Eingabe+TW'!$DJ$32:$DU$62,S181)","v":1e-06},0,0,null,{"$f":"IF(U181>'JSM Eingabe+TW'!$CU$92,'JSM Eingabe+TW'!$CU$92,\" \")","v":" "}]
[{"$nulls":18},201,165,{"$f":"LARGE('JSM Eingabe+TW'!$DJ$32:$DU$62,S182)","v":1e-06},0,0,null,{"$f":"IF(U182>'JSM Eingabe+TW'!$CU$92,'JSM Eingabe+TW'!$CU$92,\" \")","v":" "}]
[{"$nulls":18},200,166,{"$f":"LARGE('JSM Eingabe+TW'!$DJ$32:$DU$62,S183)","v":1e-06},0,0,null,{"$f":"IF(U183>'JSM Eingabe+TW'!$CU$92,'JSM Eingabe+TW'!$CU$92,\" \")","v":" "}]
[{"$nulls":18},199,167,{"$f":"LARGE('JSM Eingabe+TW'!$DJ$32:$DU$62,S184)","v":1e-06},0,0,null,{"$f":"IF(U184>'JSM Eingabe+TW'!$CU$92,'JSM Eingabe+TW'!$CU$92,\" \")","v":" "}]
[{"$nulls":18},198,168,{"$f":"LARGE('JSM Eingabe+TW'!$DJ$32:$DU$62,S185)","v":1e-06},0,0,{"$f":"E$31","v":0},{"$f":"IF(U185>'JSM Eingabe+TW'!$CU$92,'JSM Eingabe+TW'!$CU$92,\" \")","v":" "}]
[{"$nulls":18},197,169,{"$f":"LARGE('JSM Eingabe+TW'!$DJ$32:$DU$62,S186)","v":1e-06},0,0,null,{"$f":"IF(U186>'JSM Eingabe+TW'!$CU$92,'JSM Eingabe+TW'!$CU$92,\" \")","v":" "}]
[{"$nulls":18},196,170,{"$f":"LARGE('JSM Eingabe+TW'!$DJ$32:$DU$62,S187)","v":1e-06},0,0,null,{"$f":"IF(U187>'JSM Eingabe+TW'!$CU$92,'JSM Eingabe+TW'!$CU$92,\" \")","v":" "}]
[{"$nulls":18},195,171,{"$f":"LARGE('JSM Eingabe+TW'!$DJ$32:$DU$62,S188)","v":1e-06},0,0,null,{"$f":"IF(U188>'JSM Eingabe+TW'!$CU$92,'JSM Eingabe+TW'!$CU$92,\" \")","v":" "}]
[{"$nulls":18},194,172,{"$f":"LARGE('JSM Eingabe+TW'!$DJ$32:$DU$62,S189)","v":1e-06},0,0,null,{"$f":"IF(U189>'JSM Eingabe+TW'!$CU$92,'JSM Eingabe+TW'!$CU$92,\" \")","v":" "}]
[{"$nulls":18},193,173,{"$f":"LARGE('JSM Eingabe+TW'!$DJ$32:$DU$62,S190)","v":1e-06},0,0,{"$f":"E$31","v":0},{"$f":"IF(U190>'JSM Eingabe+TW'!$CU$92,'JSM Eingabe+TW'!$CU$92,\" \")","v":" "}]
[{"$nulls":18},192,174,{"$f":"LARGE('JSM Eingabe+TW'!$DJ$32:$DU$62,S191)","v":1e-06},0,0,null,{"$f":"IF(U191>'JSM Eingabe+TW'!$CU$92,'JSM Eingabe+TW'!$CU$92,\" \")","v":" "}]
[{"$nulls":18},191,175,{"$f":"LARGE('JSM Eingabe+TW'!$DJ$32:$DU$62,S192)","v":1e-06},0,0,null,{"$f":"IF(U192>'JSM Eingabe+TW'!$CU$92,'JSM Eingabe+TW'!$CU$92,\" \")","v":" "}]
[{"$nulls":18},190,176,{"$f":"LARGE('JSM Eingabe+TW'!$DJ$32:$DU$62,S193)","v":1e-06},0,0,null,{"$f":"IF(U193>'JSM Eingabe+TW'!$CU$92,'JSM Eingabe+TW'!$CU$92,\" \")","v":" "}]
[{"$nulls":18},189,177,{"$f":"LARGE('JSM Eingabe+TW'!$DJ$32:$DU$62,S194)","v":1e-06},0,0,null,{"$f":"IF(U194>'JSM Eingabe+TW'!$CU$92,'JSM Eingabe+TW'!$CU$92,\" \")","v":" "}]
[{"$nulls":18},188,178,{"$f":"LARGE('JSM Eingabe+TW'!$DJ$32:$DU$62,S195)","v":1e-06},0,0,{"$f":"E$31","v":0},{"$f":"IF(U195>'JSM Eingabe+TW'!$CU$92,'JSM Eingabe+TW'!$CU$92,\" \")","v":" "}]
[{"$nulls":18},187,179,{"$f":"LARGE('JSM Eingabe+TW'!$DJ$32:$DU$62,S196)","v":1e-06},0,0,null,{"$f":"IF(U196>'JSM Eingabe+TW'!$CU$92,'JSM Eingabe+TW'!$CU$92,\" \")","v":" "}]
[{"$nulls":18},186,180,{"$f":"LARGE('JSM Eingabe+TW'!$DJ$32:$DU$62,S197)","v":1e-06},0,0,null,{"$f":"IF(U197>'JSM Eingabe+TW'!$CU$92,'JSM Eingabe+TW'!$CU$92,\" \")","v":" "}]
[{"$nulls":18},185,181,{"$f":"LARGE('JSM Eingabe+TW'!$DJ$32:$DU$62,S198)","v":1e-06},0,0,null,{"$f":"IF(U198>'JSM Eingabe+TW'!$CU$92,'JSM Eingabe+TW'!$CU$92,\" \")","v":" "}]
[{"$nulls":18},184,182,{"$f":"LARGE('JSM Eingabe+TW'!$DJ$32:$DU$62,S199)","v":1e-06},0,0,null,{"$f":"IF(U199>'JSM Eingabe+TW'!$CU$92,'JSM Eingabe+TW'!$CU$92,\" \")","v":" "}]
[{"$nulls":18},183,183,{"$f":"LARGE('JSM Eingabe+TW'!$DJ$32:$DU$62,S200)","v":1e-06},0,0,{"$f":"E$31","v":0},{"$f":"IF(U200>'JSM Eingabe+TW'!$CU$92,'JSM Eingabe+TW'!$CU$92,\" \")","v":" "}]
[{"$nulls":18},182,184,{"$f":"LARGE('JSM Eingabe+TW'!$DJ$32:$DU$62,S201)","v":1e-06},0,0,null,{"$f":"IF(U201>'JSM Eingabe+TW'!$CU$92,'JSM Eingabe+TW'!$CU$92,\" \")","v":" "}]
[{"$nulls":18},181,185,{"$f":"LARGE('JSM Eingabe+TW'!$DJ$32:$DU$62,S202)","v":1e-06},0,0,null,{"$f":"IF(U202>'JSM Eingabe+TW'!$CU$92,'JSM Eingabe+TW'!$CU$92,\" \")","v":" "}]
[{"$nulls":18},180,186,{"$f":"LARGE('JSM Eingabe+TW'!$DJ$32:$DU$62,S203)","v":1e-06},0,0,null,{"$f":"IF(U203>'JSM Eingabe+TW'!$CU$92,'JSM Eingabe+TW'!$CU$92,\" \")","v":" "}]
[{"$nulls":18},179,187,{"$f":"LARGE('JSM Eingabe+TW'!$DJ$32:$DU$62,S204)","v":1e-06},0,0,null,{"$f":"IF(U204>'JSM Eingabe+TW'!$CU$92,'JSM Eingabe+TW'!$CU$92,\" \")","v":" "}]
[{"$nulls":18},178,188,{"$f":"LARGE('JSM Eingabe+TW'!$DJ$32:$DU$62,S205)","v":1e-06},0,0,{"$f":"E$31","v":0},{"$f":"IF(U205>'JSM Eingabe+TW'!$CU$92,'JSM Eingabe+TW'!$CU$92,\" \")","v":" "}]
[{"$nulls":18},177,189,{"$f":"LARGE('JSM Eingabe+TW'!$DJ$32:$DU$62,S206)","v":1e-06},0,0,null,{"$f":"IF(U206>'JSM Eingabe+TW'!$CU$92,'JSM Eingabe+TW'!$CU$92,\" \")","v":" "}]
[{"$nulls":18},176,190,{"$f":"LARGE('JSM Eingabe+TW'!$DJ$32:$DU$62,S207)","v":1e-06},0,0,null,{"$f":"IF(U207>'JSM Eingabe+TW'!$CU$92,'JSM Eingabe+TW'!$CU$92,\" \")","v":" "}]
[{"$nulls":18},175,191,{"$f":"LARGE('JSM Eingabe+TW'!$DJ$32:$DU$62,S208)","v":1e-06},0,0,null,{"$f":"IF(U208>'JSM Eingabe+TW'!$CU$92,'JSM Eingabe+TW'!$CU$92,\" \")","v":" "}]
[{"$nulls":18},174,192,{"$f":"LARGE('JSM Eingabe+TW'!$DJ$32:$DU$62,S209)","v":1e-06},0,0,null,{"$f":"IF(U209>'JSM Eingabe+TW'!$CU$92,'JSM Eingabe+TW'!$CU$92,\" \")","v":" "}]
[{"$nulls":18},173,193,{"$f":"LARGE('JSM Eingabe+TW'!$DJ$32:$DU$62,S210)","v":1e-06},{"$f":"IF(T210=V$13,LARGE(U$18:U$382,1),0)","v":0},{"$f":"IF(T210=W$13,LARGE(U$18:U$382,1),0)","v":0},{"$f":"E$31","v":0},{"$f":"IF(U210>'JSM Eingabe+TW'!$CU$92,'JSM Eingabe+TW'!$CU$92,\" \")","v":" "}]
[{"$nulls":18},172,194,{"$f":"LARGE('JSM Eingabe+TW'!$DJ$32:$DU$62,S211)","v":1e-06},0,0,null,{"$f":"IF(U211>'JSM Eingabe+TW'!$CU$92,'JSM Eingabe+TW'!$CU$92,\" \")","v":" "}]
[{"$nulls":18},171,195,{"$f":"LARGE('JSM Eingabe+TW'!$DJ$32:$DU$62,S212)","v":1e-06},0,0,null,{"$f":"IF(U212>'JSM Eingabe+TW'!$CU$92,'JSM Eingabe+TW'!$CU$92,\" \")","v":" "}]
[{"$nulls":18},170,196,{"$f":"LARGE('JSM Eingabe+TW'!$DJ$32:$DU$62,S213)","v":1e-06},0,0,null,{"$f":"IF(U213>'JSM Eingabe+TW'!$CU$92,'JSM Eingabe+TW'!$CU$92,\" \")","v":" "}]
[{"$nulls":18},169,197,{"$f":"LARGE('JSM Eingabe+TW'!$DJ$32:$DU$62,S214)","v":1e-06},0,0,null,{"$f":"IF(U214>'JSM Eingabe+TW'!$CU$92,'JSM Eingabe+TW'!$CU$92,\" \")","v":" "}]
[{"$nulls":18},168,198,{"$f":"LARGE('JSM Eingabe+TW'!$DJ$32:$DU$62,S215)","v":1e-06},0,0,{"$f":"E$31","v":0},{"$f":"IF(U215>'JSM Eingabe+TW'!$CU$92,'JSM Eingabe+TW'!$CU$92,\" \")","v":" "}]
[{"$nulls":18},167,199,{"$f":"LARGE('JSM Eingabe+TW'!$DJ$32:$DU$62,S216)","v":1e-06},0,0,null,{"$f":"IF(U216>'JSM Eingabe+TW'!$CU$92,'JSM Eingabe+TW'!$CU$92,\" \")","v":" "}]
[{"$nulls":18},166,200,{"$f":"LARGE('JSM Eingabe+TW'!$DJ$32:$DU$62,S217)","v":1e-06},0,0,null,{"$f":"IF(U217>'JSM Eingabe+TW'!$CU$92,'JSM Eingabe+TW'!$CU$92,\" \")","v":" "}]
[{"$nulls":18},165,201,{"$f":"LARGE('JSM Eingabe+TW'!$DJ$32:$DU$62,S218)","v":1e-06},0,0,null,{"$f":"IF(U218>'JSM Eingabe+TW'!$CU$92,'JSM Eingabe+TW'!$CU$92,\" \")","v":" "}]
[{"$nulls":18},164,202,{"$f":"LARGE('JSM Eingabe+TW'!$DJ$32:$DU$62,S219)","v":1e-06},0,0,null,{"$f":"IF(U219>'JSM Eingabe+TW'!$CU$92,'JSM Eingabe+TW'!$CU$92,\" \")","v":" "}]
[{"$nulls":18},163,203,{"$f":"LARGE('JSM Eingabe+TW'!$DJ$32:$DU$62,S220)","v":1e-06},0,0,{"$f":"E$31","v":0},{"$f":"IF(U220>'JSM Eingabe+TW'!$CU$92,'JSM Eingabe+TW'!$CU$92,\" \")","v":" "}]
[{"$nulls":18},162,204,{"$f":"LARGE('JSM Eingabe+TW'!$DJ$32:$DU$62,S221)","v":1e-06},0,0,null,{"$f":"IF(U221>'JSM Eingabe+TW'!$CU$92,'JSM Eingabe+TW'!$CU$92,\" \")","v":" "}]
[{"$nulls":18},161,205,{"$f":"LARGE('JSM Eingabe+TW'!$DJ$32:$DU$62,S222)","v":1e-06},0,0,null,{"$f":"IF(U222>'JSM Eingabe+TW'!$CU$92,'JSM Eingabe+TW'!$CU$92,\" \")","v":" "}]
[{"$nulls":18},160,206,{"$f":"LARGE('JSM Eingabe+TW'!$DJ$32:$DU$62,S223)","v":1e-06},0,0,null,{"$f":"IF(U223>'JSM Eingabe+TW'!$CU$92,'JSM Eingabe+TW'!$CU$92,\" \")","v":" "}]
[{"$nulls":18},159,207,{"$f":"LARGE('JSM Eingabe+TW'!$DJ$32:$DU$62,S224)","v":1e-06},0,0,null,{"$f":"IF(U224>'JSM Eingabe+TW'!$CU$92,'JSM Eingabe+TW'!$CU$92,\" \")","v":" "}]
[{"$nulls":18},158,208,{"$f":"LARGE('JSM Eingabe+TW'!$DJ$32:$DU$62,S225)","v":1e-06},0,0,{"$f":"E$31","v":0},{"$f":"IF(U225>'JSM Eingabe+TW'!$CU$92,'JSM Eingabe+TW'!$CU$92,\" \")","v":" "}]
[{"$nulls":18},157,209,{"$f":"LARGE('JSM Eingabe+TW'!$DJ$32:$DU$62,S226)","v":1e-06},0,0,null,{"$f":"IF(U226>'JSM Eingabe+TW'!$CU$92,'JSM Eingabe+TW'!$CU$92,\" \")","v":" "}]
[{"$nulls":18},156,210,{"$f":"LARGE('JSM Eingabe+TW'!$DJ$32:$DU$62,S227)","v":1e-06},0,0,null,{"$f":"IF(U227>'JSM Eingabe+TW'!$CU$92,'JSM Eingabe+TW'!$CU$92,\" \")","v":" "}]
[{"$nulls":18},155,211,{"$f":"LARGE('JSM Eingabe+TW'!$DJ$32:$DU$62,S228)","v":1e-06},0,0,null,{"$f":"IF(U228>'JSM Eingabe+TW'!$CU$92,'JSM Eingabe+TW'!$CU$92,\" \")","v":" "}]
[{"$nulls":18},154,212,{"$f":"LARGE('JSM Eingabe+TW'!$DJ$32:$DU$62,S229)","v":1e-06},0,0,null,{"$f":"IF(U229>'JSM Eingabe+TW'!$CU$92,'JSM Eingabe+TW'!$CU$92,\" \")","v":" "}]
[{"$nulls":18},153,213,{"$f":"LARGE('JSM Eingabe+TW'!$DJ$32:$DU$62,S230)","v":1e-06},0,0,{"$f":"E$31","v":0},{"$f":"IF(U230>'JSM Eingabe+TW'!$CU$92,'JSM Eingabe+TW'!$CU$92,\" \")","v":" "}]
[{"$nulls":18},152,214,{"$f":"LARGE('JSM Eingabe+TW'!$DJ$32:$DU$62,S231)","v":1e-06},0,0,null,{"$f":"IF(U231>'JSM Eingabe+TW'!$CU$92,'JSM Eingabe+TW'!$CU$92,\" \")","v":" "}]
[{"$nulls":18},151,215,{"$f":"LARGE('JSM Eingabe+TW'!$DJ$32:$DU$62,S232)","v":1e-06},0,0,null,{"$f":"IF(U232>'JSM Eingabe+TW'!$CU$92,'JSM Eingabe+TW'!$CU$92,\" \")","v":" "}]
[{"$nulls":18},150,216,{"$f":"LARGE('JSM Eingabe+TW'!$DJ$32:$DU$62,S233)","v":1e-06},0,0,null,{"$f":"IF(U233>'JSM Eingabe+TW'!$CU$92,'JSM Eingabe+TW'!$CU$92,\" \")","v":" "}]
[{"$nulls":18},149,217,{"$f":"LARGE('JSM Eingabe+TW'!$DJ$32:$DU$62,S234)","v":1e-06},0,0,null,{"$f":"IF(U234>'JSM Eingabe+TW'!$CU$92,'JSM Eingabe+TW'!$CU$92,\" \")","v":" "}]
[{"$nulls":18},148,218,{"$f":"LARGE('JSM Eingabe+TW'!$DJ$32:$DU$62,S235)","v":1e-06},0,0,{"$f":"E$31","v":0},{"$f":"IF(U235>'JSM Eingabe+TW'!$CU$92,'JSM Eingabe+TW'!$CU$92,\" \")","v":" "}]
[{"$nulls":18},147,219,{"$f":"LARGE('JSM Eingabe+TW'!$DJ$32:$DU$62,S236)","v":1e-06},0,0,null,{"$f":"IF(U236>'JSM Eingabe+TW'!$CU$92,'JSM Eingabe+TW'!$CU$92,\" \")","v":" "}]
[{"$nulls":18},146,220,{"$f":"LARGE('JSM Eingabe+TW'!$DJ$32:$DU$62,S237)","v":1e-06},0,0,null,{"$f":"IF(U237>'JSM Eingabe+TW'!$CU$92,'JSM Eingabe+TW'!$CU$92,\" \")","v":" "}]
[{"$nulls":18},145,221,{"$f":"LARGE('JSM Eingabe+TW'!$DJ$32:$DU$62,S238)","v":1e-06},0,0,null,{"$f":"IF(U238>'JSM Eingabe+TW'!$CU$92,'JSM Eingabe+TW'!$CU$92,\" \")","v":" "}]
[{"$nulls":18},144,222,{"$f":"LARGE('JSM Eingabe+TW'!$DJ$32:$DU$62,S239)","v":1e-06},0,0,null,{"$f":"IF(U239>'JSM Eingabe+TW'!$CU$92,'JSM Eingabe+TW'!$CU$92,\" \")","v":" "}]
[{"$nulls":18},143,223,{"$f":"LARGE('JSM Eingabe+TW'!$DJ$32:$DU$62,S240)","v":1e-06},0,0,{"$f":"E$31","v":0},{"$f":"IF(U240>'JSM Eingabe+TW'!$CU$92,'JSM Eingabe+TW'!$CU$92,\" \")","v":" "}]
[{"$nulls":18},142,224,{"$f":"LARGE('JSM Eingabe+TW'!$DJ$32:$DU$62,S241)","v":1e-06},0,0,null,{"$f":"IF(U241>'JSM Eingabe+TW'!$CU$92,'JSM Eingabe+TW'!$CU$92,\" \")","v":" "}]
[{"$nulls":18},141,225,{"$f":"LARGE('JSM Eingabe+TW'!$DJ$32:$DU$62,S242)","v":1e-06},0,0,null,{"$f":"IF(U242>'JSM Eingabe+TW'!$CU$92,'JSM Eingabe+TW'!$CU$92,\" \")","v":" "}]
[{"$nulls":18},140,226,{"$f":"LARGE('JSM Eingabe+TW'!$DJ$32:$DU$62,S243)","v":1e-06},0,0,null,{"$f":"IF(U243>'JSM Eingabe+TW'!$CU$92,'JSM Eingabe+TW'!$CU$92,\" \")","v":" "}]
[{"$nulls":18},139,227,{"$f":"LARGE('JSM Eingabe+TW'!$DJ$32:$DU$62,S244)","v":1e-06},0,0,null,{"$f":"IF(U244>'JSM Eingabe+TW'!$CU$92,'JSM Eingabe+TW'!$CU$92,\" \")","v":" "}]
[{"$nulls":18},138,228,{"$f":"LARGE('JSM Eingabe+TW'!$DJ$32:$DU$62,S245)","v":1e-06},0,0,{"$f":"E$31","v":0},{"$f":"IF(U245>'JSM Eingabe+TW'!$CU$92,'JSM Eingabe+TW'!$CU$92,\" \")","v":" "}]
[{"$nulls":18},137,229,{"$f":"LARGE('JSM Eingabe+TW'!$DJ$32:$DU$62,S246)","v":1e-06},0,0,null,{"$f":"IF(U246>'JSM Eingabe+TW'!$CU$92,'JSM Eingabe+TW'!$CU$92,\" \")","v":" "}]
[{"$nulls":18},136,230,{"$f":"LARGE('JSM Eingabe+TW'!$DJ$32:$DU$62,S247)","v":1e-06},0,0,null,{"$f":"IF(U247>'JSM Eingabe+TW'!$CU$92,'JSM Eingabe+TW'!$CU$92,\" \")","v":" "}]
[{"$nulls":18},135,231,{"$f":"LARGE('JSM Eingabe+TW'!$DJ$32:$DU$62,S248)","v":1e-06},0,0,null,{"$f":"IF(U248>'JSM Eingabe+TW'!$CU$92,'JSM Eingabe+TW'!$CU$92,\" \")","v":" "}]
[{"$nulls":18},134,232,{"$f":"LARGE('JSM Eingabe+TW'!$DJ$32:$DU$62,S249)","v":1e-06},0,0,null,{"$f":"IF(U249>'JSM Eingabe+TW'!$CU$92,'JSM Eingabe+TW'!$CU$92,\" \")","v":" "}]
[{"$nulls":18},133,233,{"$f":"LARGE('JSM Eingabe+TW'!$DJ$32:$DU$62,S250)","v":1e-06},0,0,{"$f":"E$31","v":0},{"$f":"IF(U250>'JSM Eingabe+TW'!$CU$92,'JSM Eingabe+TW'!$CU$92,\" \")","v":" "}]
[{"$nulls":18},132,234,{"$f":"LARGE('JSM Eingabe+TW'!$DJ$32:$DU$62,S251)","v":1e-06},0,0,null,{"$f":"IF(U251>'JSM Eingabe+TW'!$CU$92,'JSM Eingabe+TW'!$CU$92,\" \")","v":" "}]
[{"$nulls":18},131,235,{"$f":"LARGE('JSM Eingabe+TW'!$DJ$32:$DU$62,S252)","v":1e-06},0,0,null,{"$f":"IF(U252>'JSM Eingabe+TW'!$CU$92,'JSM Eingabe+TW'!$CU$92,\" \")","v":" "}]
[{"$nulls":18},130,236,{"$f":"LARGE('JSM Eingabe+TW'!$DJ$32:$DU$62,S253)","v":1e-06},0,0,null,{"$f":"IF(U253>'JSM Eingabe+TW'!$CU$92,'JSM Eingabe+TW'!$CU$92,\" \")","v":" "}]
[{"$nulls":18},129,237,{"$f":"LARGE('JSM Eingabe+TW'!$DJ$32:$DU$62,S254)","v":1e-06},0,0,null,{"$f":"IF(U254>'JSM Eingabe+TW'!$CU$92,'JSM Eingabe+TW'!$CU$92,\" \")","v":" "}]
[{"$nulls":18},128,238,{"$f":"LARGE('JSM Eingabe+TW'!$DJ$32:$DU$62,S255)","v":1e-06},0,0,{"$f":"E$31","v":0},{"$f":"IF(U255>'JSM Eingabe+TW'!$CU$92,'JSM Eingabe+TW'!$CU$92,\" \")","v":" "}]
[{"$nulls":18},127,239,{"$f":"LARGE('JSM Eingabe+TW'!$DJ$32:$DU$62,S256)","v":1e-06},0,0,null,{"$f":"IF(U256>'JSM Eingabe+TW'!$CU$92,'JSM Eingabe+TW'!$CU$92,\" \")","v":" "}]
[{"$nulls":18},126,240,{"$f":"LARGE('JSM Eingabe+TW'!$DJ$32:$DU$62,S257)","v":1e-06},0,0,null,{"$f":"IF(U257>'JSM Eingabe+TW'!$CU$92,'JSM Eingabe+TW'!$CU$92,\" \")","v":" "}]
[{"$nulls":18},125,241,{"$f":"LARGE('JSM Eingabe+TW'!$DJ$32:$DU$62,S258)","v":1e-06},0,0,null,{"$f":"IF(U258>'JSM Eingabe+TW'!$CU$92,'JSM Eingabe+TW'!$CU$92,\" \")","v":" "}]
[{"$nulls":18},124,242,{"$f":"LARGE('JSM Eingabe+TW'!$DJ$32:$DU$62,S259)","v":1e-06},0,0,null,{"$f":"IF(U259>'JSM Eingabe+TW'!$CU$92,'JSM Eingabe+TW'!$CU$92,\" \")","v":" "}]
[{"$nulls":18},123,243,{"$f":"LARGE('JSM Eingabe+TW'!$DJ$32:$DU$62,S260)","v":1e-06},0,0,{"$f":"E$31","v":0},{"$f":"IF(U260>'JSM Eingabe+TW'!$CU$92,'JSM Eingabe+TW'!$CU$92,\" \")","v":" "}]
[{"$nulls":18},122,244,{"$f":"LARGE('JSM Eingabe+TW'!$DJ$32:$DU$62,S261)","v":1e-06},0,0,null,{"$f":"IF(U261>'JSM Eingabe+TW'!$CU$92,'JSM Eingabe+TW'!$CU$92,\" \")","v":" "}]
[{"$nulls":18},121,245,{"$f":"LARGE('JSM Eingabe+TW'!$DJ$32:$DU$62,S262)","v":1e-06},0,0,null,{"$f":"IF(U262>'JSM Eingabe+TW'!$CU$92,'JSM Eingabe+TW'!$CU$92,\" \")","v":" "}]
[{"$nulls":18},120,246,{"$f":"LARGE('JSM Eingabe+TW'!$DJ$32:$DU$62,S263)","v":1e-06},0,0,null,{"$f":"IF(U263>'JSM Eingabe+TW'!$CU$92,'JSM Eingabe+TW'!$CU$92,\" \")","v":" "}]
[{"$nulls":18},119,247,{"$f":"LARGE('JSM Eingabe+TW'!$DJ$32:$DU$62,S264)","v":1e-06},0,0,null,{"$f":"IF(U264>'JSM Eingabe+TW'!$CU$92,'JSM Eingabe+TW'!$CU$92,\" \")","v":" "}]
[{"$nulls":18},118,248,{"$f":"LARGE('JSM Eingabe+TW'!$DJ$32:$DU$62,S265)","v":1e-06},0,0,{"$f":"E$31","v":0},{"$f":"IF(U265>'JSM Eingabe+TW'!$CU$92,'JSM Eingabe+TW'!$CU$92,\" \")","v":" "}]
[{"$nulls":18},117,249,{"$f":"LARGE('JSM Eingabe+TW'!$DJ$32:$DU$62,S266)","v":1e-06},0,0,null,{"$f":"IF(U266>'JSM Eingabe+TW'!$CU$92,'JSM Eingabe+TW'!$CU$92,\" \")","v":" "}]
[{"$nulls":18},116,250,{"$f":"LARGE('JSM Eingabe+TW'!$DJ$32:$DU$62,S267)","v":1e-06},0,0,null,{"$f":"IF(U267>'JSM Eingabe+TW'!$CU$92,'JSM Eingabe+TW'!$CU$92,\" \")","v":" "}]
[{"$nulls":18},115,251,{"$f":"LARGE('JSM Eingabe+TW'!$DJ$32:$DU$62,S268)","v":1e-06},0,0,null,{"$f":"IF(U268>'JSM Eingabe+TW'!$CU$92,'JSM Eingabe+TW'!$CU$92,\" \")","v":" "}]
[{"$nulls":18},114,252,{"$f":"LARGE('JSM Eingabe+TW'!$DJ$32:$DU$62,S269)","v":1e-06},0,0,null,{"$f":"IF(U269>'JSM Eingabe+TW'!$CU$92,'JSM Eingabe+TW'!$CU$92,\" \")","v":" "}]
[{"$nulls":18},113,253,{"$f":"LARGE('JSM Eingabe+TW'!$DJ$32:$DU$62,S270)","v":1e-06},0,0,{"$f":"E$31","v":0},{"$f":"IF(U270>'JSM Eingabe+TW'!$CU$92,'JSM Eingabe+TW'!$CU$92,\" \")","v":" "}]
[{"$nulls":18},112,254,{"$f":"LARGE('JSM Eingabe+TW'!$DJ$32:$DU$62,S271)","v":1e-06},0,0,null,{"$f":"IF(U271>'JSM Eingabe+TW'!$CU$92,'JSM Eingabe+TW'!$CU$92,\" \")","v":" "}]
[{"$nulls":18},111,255,{"$f":"LARGE('JSM Eingabe+TW'!$DJ$32:$DU$62,S272)","v":1e-06},0,0,null,{"$f":"IF(U272>'JSM Eingabe+TW'!$CU$92,'JSM Eingabe+TW'!$CU$92,\" \")","v":" "}]
[{"$nulls":18},110,256,{"$f":"LARGE('JSM Eingabe+TW'!$DJ$32:$DU$62,S273)","v":1e-06},0,0,null,{"$f":"IF(U273>'JSM Eingabe+TW'!$CU$92,'JSM Eingabe+TW'!$CU$92,\" \")","v":" "}]
[{"$nulls":18},109,257,{"$f":"LARGE('JSM Eingabe+TW'!$DJ$32:$DU$62,S274)","v":1e-06},{"$f":"IF(T274=V$13,LARGE(U$18:U$382,1),0)","v":0},{"$f":"IF(T274=W$13,LARGE(U$18:U$382,1),0)","v":0},null,{"$f":"IF(U274>'JSM Eingabe+TW'!$CU$92,'JSM Eingabe+TW'!$CU$92,\" \")","v":" "}]
[{"$nulls":18},108,258,{"$f":"LARGE('JSM Eingabe+TW'!$DJ$32:$DU$62,S275)","v":1e-06},0,0,{"$f":"E$31","v":0},{"$f":"IF(U275>'JSM Eingabe+TW'!$CU$92,'JSM Eingabe+TW'!$CU$92,\" \")","v":" "}]
[{"$nulls":18},107,259,{"$f":"LARGE('JSM Eingabe+TW'!$DJ$32:$DU$62,S276)","v":1e-06},0,0,null,{"$f":"IF(U276>'JSM Eingabe+TW'!$CU$92,'JSM Eingabe+TW'!$CU$92,\" \")","v":" "}]
[{"$nulls":18},106,260,{"$f":"LARGE('JSM Eingabe+TW'!$DJ$32:$DU$62,S277)","v":1e-06},0,0,null,{"$f":"IF(U277>'JSM Eingabe+TW'!$CU$92,'JSM Eingabe+TW'!$CU$92,\" \")","v":" "}]
[{"$nulls":18},105,261,{"$f":"LARGE('JSM Eingabe+TW'!$DJ$32:$DU$62,S278)","v":1e-06},0,0,null,{"$f":"IF(U278>'JSM Eingabe+TW'!$CU$92,'JSM Eingabe+TW'!$CU$92,\" \")","v":" "}]
[{"$nulls":18},104,262,{"$f":"LARGE('JSM Eingabe+TW'!$DJ$32:$DU$62,S279)","v":1e-06},0,0,null,{"$f":"IF(U279>'JSM Eingabe+TW'!$CU$92,'JSM Eingabe+TW'!$CU$92,\" \")","v":" "}]
[{"$nulls":18},103,263,{"$f":"LARGE('JSM Eingabe+TW'!$DJ$32:$DU$62,S280)","v":1e-06},0,0,{"$f":"E$31","v":0},{"$f":"IF(U280>'JSM Eingabe+TW'!$CU$92,'JSM Eingabe+TW'!$CU$92,\" \")","v":" "}]
[{"$nulls":18},102,264,{"$f":"LARGE('JSM Eingabe+TW'!$DJ$32:$DU$62,S281)","v":1e-06},0,0,null,{"$f":"IF(U281>'JSM Eingabe+TW'!$CU$92,'JSM Eingabe+TW'!$CU$92,\" \")","v":" "}]
[{"$nulls":18},101,265,{"$f":"LARGE('JSM Eingabe+TW'!$DJ$32:$DU$62,S282)","v":1e-06},0,0,null,{"$f":"IF(U282>'JSM Eingabe+TW'!$CU$92,'JSM Eingabe+TW'!$CU$92,\" \")","v":" "}]
[{"$nulls":18},100,266,{"$f":"LARGE('JSM Eingabe+TW'!$DJ$32:$DU$62,S283)","v":1e-06},0,0,null,{"$f":"IF(U283>'JSM Eingabe+TW'!$CU$92,'JSM Eingabe+TW'!$CU$92,\" \")","v":" "}]
[{"$nulls":18},99,267,{"$f":"LARGE('JSM Eingabe+TW'!$DJ$32:$DU$62,S284)","v":1e-06},0,0,null,{"$f":"IF(U284>'JSM Eingabe+TW'!$CU$92,'JSM Eingabe+TW'!$CU$92,\" \")","v":" "}]
[{"$nulls":18},98,268,{"$f":"LARGE('JSM Eingabe+TW'!$DJ$32:$DU$62,S285)","v":1e-06},0,0,{"$f":"E$31","v":0},{"$f":"IF(U285>'JSM Eingabe+TW'!$CU$92,'JSM Eingabe+TW'!$CU$92,\" \")","v":" "}]
[{"$nulls":18},97,269,{"$f":"LARGE('JSM Eingabe+TW'!$DJ$32:$DU$62,S286)","v":1e-06},0,0,null,{"$f":"IF(U286>'JSM Eingabe+TW'!$CU$92,'JSM Eingabe+TW'!$CU$92,\" \")","v":" "}]
[{"$nulls":18},96,270,{"$f":"LARGE('JSM Eingabe+TW'!$DJ$32:$DU$62,S287)","v":1e-06},0,0,null,{"$f":"IF(U287>'JSM Eingabe+TW'!$CU$92,'JSM Eingabe+TW'!$CU$92,\" \")","v":" "}]
[{"$nulls":18},95,271,{"$f":"LARGE('JSM Eingabe+TW'!$DJ$32:$DU$62,S288)","v":1e-06},0,0,null,{"$f":"IF(U288>'JSM Eingabe+TW'!$CU$92,'JSM Eingabe+TW'!$CU$92,\" \")","v":" "}]
[{"$nulls":18},94,272,{"$f":"LARGE('JSM Eingabe+TW'!$DJ$32:$DU$62,S289)","v":1e-06},0,0,null,{"$f":"IF(U289>'JSM Eingabe+TW'!$CU$92,'JSM Eingabe+TW'!$CU$92,\" \")","v":" "}]
[{"$nulls":18},93,273,{"$f":"LARGE('JSM Eingabe+TW'!$DJ$32:$DU$62,S290)","v":1e-06},0,0,{"$f":"E$31","v":0},{"$f":"IF(U290>'JSM Eingabe+TW'!$CU$92,'JSM Eingabe+TW'!$CU$92,\" \")","v":" "}]
[{"$nulls":18},92,274,{"$f":"LARGE('JSM Eingabe+TW'!$DJ$32:$DU$62,S291)","v":1e-06},0,0,null,{"$f":"IF(U291>'JSM Eingabe+TW'!$CU$92,'JSM Eingabe+TW'!$CU$92,\" \")","v":" "}]
[{"$nulls":18},91,275,{"$f":"LARGE('JSM Eingabe+TW'!$DJ$32:$DU$62,S292)","v":1e-06},0,0,null,{"$f":"IF(U292>'JSM Eingabe+TW'!$CU$92,'JSM Eingabe+TW'!$CU$92,\" \")","v":" "}]
[{"$nulls":18},90,276,{"$f":"LARGE('JSM Eingabe+TW'!$DJ$32:$DU$62,S293)","v":1e-06},0,0,null,{"$f":"IF(U293>'JSM Eingabe+TW'!$CU$92,'JSM Eingabe+TW'!$CU$92,\" \")","v":" "}]
[{"$nulls":18},89,277,{"$f":"LARGE('JSM Eingabe+TW'!$DJ$32:$DU$62,S294)","v":1e-06},0,0,null,{"$f":"IF(U294>'JSM Eingabe+TW'!$CU$92,'JSM Eingabe+TW'!$CU$92,\" \")","v":" "}]
[{"$nulls":18},88,278,{"$f":"LARGE('JSM Eingabe+TW'!$DJ$32:$DU$62,S295)","v":1e-06},0,0,{"$f":"E$31","v":0},{"$f":"IF(U295>'JSM Eingabe+TW'!$CU$92,'JSM Eingabe+TW'!$CU$92,\" \")","v":" "}]
[{"$nulls":18},87,279,{"$f":"LARGE('JSM Eingabe+TW'!$DJ$32:$DU$62,S296)","v":1e-06},0,0,null,{"$f":"IF(U296>'JSM Eingabe+TW'!$CU$92,'JSM Eingabe+TW'!$CU$92,\" \")","v":" "}]
[{"$nulls":18},86,280,{"$f":"LARGE('JSM Eingabe+TW'!$DJ$32:$DU$62,S297)","v":1e-06},0,0,null,{"$f":"IF(U297>'JSM Eingabe+TW'!$CU$92,'JSM Eingabe+TW'!$CU$92,\" \")","v":" "}]
[{"$nulls":18},85,281,{"$f":"LARGE('JSM Eingabe+TW'!$DJ$32:$DU$62,S298)","v":1e-06},0,0,null,{"$f":"IF(U298>'JSM Eingabe+TW'!$CU$92,'JSM Eingabe+TW'!$CU$92,\" \")","v":" "}]
[{"$nulls":18},84,282,{"$f":"LARGE('JSM Eingabe+TW'!$DJ$32:$DU$62,S299)","v":1e-06},0,0,null,{"$f":"IF(U299>'JSM Eingabe+TW'!$CU$92,'JSM Eingabe+TW'!$CU$92,\" \")","v":" "}]
[{"$nulls":18},83,283,{"$f":"LARGE('JSM Eingabe+TW'!$DJ$32:$DU$62,S300)","v":1e-06},0,0,{"$f":"E$31","v":0},{"$f":"IF(U300>'JSM Eingabe+TW'!$CU$92,'JSM Eingabe+TW'!$CU$92,\" \")","v":" "}]
[{"$nulls":18},82,284,{"$f":"LARGE('JSM Eingabe+TW'!$DJ$32:$DU$62,S301)","v":1e-06},0,0,null,{"$f":"IF(U301>'JSM Eingabe+TW'!$CU$92,'JSM Eingabe+TW'!$CU$92,\" \")","v":" "}]
[{"$nulls":18},81,285,{"$f":"LARGE('JSM Eingabe+TW'!$DJ$32:$DU$62,S302)","v":1e-06},0,0,null,{"$f":"IF(U302>'JSM Eingabe+TW'!$CU$92,'JSM Eingabe+TW'!$CU$92,\" \")","v":" "}]
[{"$nulls":18},80,286,{"$f":"LARGE('JSM Eingabe+TW'!$DJ$32:$DU$62,S303)","v":1e-06},0,0,null,{"$f":"IF(U303>'JSM Eingabe+TW'!$CU$92,'JSM Eingabe+TW'!$CU$92,\" \")","v":" "}]
[{"$nulls":18},79,287,{"$f":"LARGE('JSM Eingabe+TW'!$DJ$32:$DU$62,S304)","v":1e-06},0,0,null,{"$f":"IF(U304>'JSM Eingabe+TW'!$CU$92,'JSM Eingabe+TW'!$CU$92,\" \")","v":" "}]
[{"$nulls":18},78,288,{"$f":"LARGE('JSM Eingabe+TW'!$DJ$32:$DU$62,S305)","v":1e-06},0,0,{"$f":"E$31","v":0},{"$f":"IF(U305>'JSM Eingabe+TW'!$CU$92,'JSM Eingabe+TW'!$CU$92,\" \")","v":" "}]
[{"$nulls":18},77,289,{"$f":"LARGE('JSM Eingabe+TW'!$DJ$32:$DU$62,S306)","v":1e-06},0,0,null,{"$f":"IF(U306>'JSM Eingabe+TW'!$CU$92,'JSM Eingabe+TW'!$CU$92,\" \")","v":" "}]
[{"$nulls":18},76,290,{"$f":"LARGE('JSM Eingabe+TW'!$DJ$32:$DU$62,S307)","v":1e-06},0,0,null,{"$f":"IF(U307>'JSM Eingabe+TW'!$CU$92,'JSM Eingabe+TW'!$CU$92,\" \")","v":" "}]
[{"$nulls":18},75,291,{"$f":"LARGE('JSM Eingabe+TW'!$DJ$32:$DU$62,S308)","v":1e-06},0,0,null,{"$f":"IF(U308>'JSM Eingabe+TW'!$CU$92,'JSM Eingabe+TW'!$CU$92,\" \")","v":" "}]
[{"$nulls":18},74,292,{"$f":"LARGE('JSM Eingabe+TW'!$DJ$32:$DU$62,S309)","v":1e-06},0,0,null,{"$f":"IF(U309>'JSM Eingabe+TW'!$CU$92,'JSM Eingabe+TW'!$CU$92,\" \")","v":" "}]
[{"$nulls":18},73,293,{"$f":"LARGE('JSM Eingabe+TW'!$DJ$32:$DU$62,S310)","v":1e-06},0,0,{"$f":"E$31","v":0},{"$f":"IF(U310>'JSM Eingabe+TW'!$CU$92,'JSM Eingabe+TW'!$CU$92,\" \")","v":" "}]
[{"$nulls":18},72,294,{"$f":"LARGE('JSM Eingabe+TW'!$DJ$32:$DU$62,S311)","v":1e-06},0,0,null,{"$f":"IF(U311>'JSM Eingabe+TW'!$CU$92,'JSM Eingabe+TW'!$CU$92,\" \")","v":" "}]
[{"$nulls":18},71,295,{"$f":"LARGE('JSM Eingabe+TW'!$DJ$32:$DU$62,S312)","v":1e-06},0,0,null,{"$f":"IF(U312>'JSM Eingabe+TW'!$CU$92,'JSM Eingabe+TW'!$CU$92,\" \")","v":" "}]
[{"$nulls":18},70,296,{"$f":"LARGE('JSM Eingabe+TW'!$DJ$32:$DU$62,S313)","v":1e-06},0,0,null,{"$f":"IF(U313>'JSM Eingabe+TW'!$CU$92,'JSM Eingabe+TW'!$CU$92,\" \")","v":" "}]
[{"$nulls":18},69,297,{"$f":"LARGE('JSM Eingabe+TW'!$DJ$32:$DU$62,S314)","v":1e-06},0,0,null,{"$f":"IF(U314>'JSM Eingabe+TW'!$CU$92,'JSM Eingabe+TW'!$CU$92,\" \")","v":" "}]
[{"$nulls":18},68,298,{"$f":"LARGE('JSM Eingabe+TW'!$DJ$32:$DU$62,S315)","v":1e-06},0,0,{"$f":"E$31","v":0},{"$f":"IF(U315>'JSM Eingabe+TW'!$CU$92,'JSM Eingabe+TW'!$CU$92,\" \")","v":" "}]
[{"$nulls":18},67,299,{"$f":"LARGE('JSM Eingabe+TW'!$DJ$32:$DU$62,S316)","v":1e-06},0,0,null,{"$f":"IF(U316>'JSM Eingabe+TW'!$CU$92,'JSM Eingabe+TW'!$CU$92,\" \")","v":" "}]
[{"$nulls":18},66,300,{"$f":"LARGE('JSM Eingabe+TW'!$DJ$32:$DU$62,S317)","v":1e-06},0,0,null,{"$f":"IF(U317>'JSM Eingabe+TW'!$CU$92,'JSM Eingabe+TW'!$CU$92,\" \")","v":" "}]
[{"$nulls":18},65,301,{"$f":"LARGE('JSM Eingabe+TW'!$DJ$32:$DU$62,S318)","v":1e-06},0,0,null,{"$f":"IF(U318>'JSM Eingabe+TW'!$CU$92,'JSM Eingabe+TW'!$CU$92,\" \")","v":" "}]
[{"$nulls":18},64,302,{"$f":"LARGE('JSM Eingabe+TW'!$DJ$32:$DU$62,S319)","v":1e-06},0,0,null,{"$f":"IF(U319>'JSM Eingabe+TW'!$CU$92,'JSM Eingabe+TW'!$CU$92,\" \")","v":" "}]
[{"$nulls":18},63,303,{"$f":"LARGE('JSM Eingabe+TW'!$DJ$32:$DU$62,S320)","v":1e-06},0,0,{"$f":"E$31","v":0},{"$f":"IF(U320>'JSM Eingabe+TW'!$CU$92,'JSM Eingabe+TW'!$CU$92,\" \")","v":" "}]
[{"$nulls":18},62,304,{"$f":"LARGE('JSM Eingabe+TW'!$DJ$32:$DU$62,S321)","v":1e-06},0,0,null,{"$f":"IF(U321>'JSM Eingabe+TW'!$CU$92,'JSM Eingabe+TW'!$CU$92,\" \")","v":" "}]
[{"$nulls":18},61,305,{"$f":"LARGE('JSM Eingabe+TW'!$DJ$32:$DU$62,S322)","v":1e-06},0,0,null,{"$f":"IF(U322>'JSM Eingabe+TW'!$CU$92,'JSM Eingabe+TW'!$CU$92,\" \")","v":" "}]
[{"$nulls":18},60,306,{"$f":"LARGE('JSM Eingabe+TW'!$DJ$32:$DU$62,S323)","v":1e-06},0,0,null,{"$f":"IF(U323>'JSM Eingabe+TW'!$CU$92,'JSM Eingabe+TW'!$CU$92,\" \")","v":" "}]
[{"$nulls":18},59,307,{"$f":"LARGE('JSM Eingabe+TW'!$DJ$32:$DU$62,S324)","v":1e-06},0,0,null,{"$f":"IF(U324>'JSM Eingabe+TW'!$CU$92,'JSM Eingabe+TW'!$CU$92,\" \")","v":" "}]
[{"$nulls":18},58,308,{"$f":"LARGE('JSM Eingabe+TW'!$DJ$32:$DU$62,S325)","v":1e-06},0,0,{"$f":"E$31","v":0},{"$f":"IF(U325>'JSM Eingabe+TW'!$CU$92,'JSM Eingabe+TW'!$CU$92,\" \")","v":" "}]
[{"$nulls":18},57,309,{"$f":"LARGE('JSM Eingabe+TW'!$DJ$32:$DU$62,S326)","v":1e-06},0,0,null,{"$f":"IF(U326>'JSM Eingabe+TW'!$CU$92,'JSM Eingabe+TW'!$CU$92,\" \")","v":" "}]
[{"$nulls":18},56,310,{"$f":"LARGE('JSM Eingabe+TW'!$DJ$32:$DU$62,S327)","v":1e-06},0,0,null,{"$f":"IF(U327>'JSM Eingabe+TW'!$CU$92,'JSM Eingabe+TW'!$CU$92,\" \")","v":" "}]
[{"$nulls":18},55,311,{"$f":"LARGE('JSM Eingabe+TW'!$DJ$32:$DU$62,S328)","v":1e-06},0,0,null,{"$f":"IF(U328>'JSM Eingabe+TW'!$CU$92,'JSM Eingabe+TW'!$CU$92,\" \")","v":" "}]
[{"$nulls":18},54,312,{"$f":"LARGE('JSM Eingabe+TW'!$DJ$32:$DU$62,S329)","v":1e-06},0,0,null,{"$f":"IF(U329>'JSM Eingabe+TW'!$CU$92,'JSM Eingabe+TW'!$CU$92,\" \")","v":" "}]
[{"$nulls":18},53,313,{"$f":"LARGE('JSM Eingabe+TW'!$DJ$32:$DU$62,S330)","v":1e-06},0,0,{"$f":"E$31","v":0},{"$f":"IF(U330>'JSM Eingabe+TW'!$CU$92,'JSM Eingabe+TW'!$CU$92,\" \")","v":" "}]
[{"$nulls":18},52,314,{"$f":"LARGE('JSM Eingabe+TW'!$DJ$32:$DU$62,S331)","v":1e-06},0,0,null,{"$f":"IF(U331>'JSM Eingabe+TW'!$CU$92,'JSM Eingabe+TW'!$CU$92,\" \")","v":" "}]
[{"$nulls":18},51,315,{"$f":"LARGE('JSM Eingabe+TW'!$DJ$32:$DU$62,S332)","v":1e-06},0,0,null,{"$f":"IF(U332>'JSM Eingabe+TW'!$CU$92,'JSM Eingabe+TW'!$CU$92,\" \")","v":" "}]
[{"$nulls":18},50,316,{"$f":"LARGE('JSM Eingabe+TW'!$DJ$32:$DU$62,S333)","v":1e-06},0,0,null,{"$f":"IF(U333>'JSM Eingabe+TW'!$CU$92,'JSM Eingabe+TW'!$CU$92,\" \")","v":" "}]
[{"$nulls":18},49,317,{"$f":"LARGE('JSM Eingabe+TW'!$DJ$32:$DU$62,S334)","v":1e-06},0,0,null,{"$f":"IF(U334>'JSM Eingabe+TW'!$CU$92,'JSM Eingabe+TW'!$CU$92,\" \")","v":" "}]
[{"$nulls":18},48,318,{"$f":"LARGE('JSM Eingabe+TW'!$DJ$32:$DU$62,S335)","v":1e-06},0,0,{"$f":"E$31","v":0},{"$f":"IF(U335>'JSM Eingabe+TW'!$CU$92,'JSM Eingabe+TW'!$CU$92,\" \")","v":" "}]
[{"$nulls":18},47,319,{"$f":"LARGE('JSM Eingabe+TW'!$DJ$32:$DU$62,S336)","v":1e-06},0,0,null,{"$f":"IF(U336>'JSM Eingabe+TW'!$CU$92,'JSM Eingabe+TW'!$CU$92,\" \")","v":" "}]
[{"$nulls":18},46,320,{"$f":"LARGE('JSM Eingabe+TW'!$DJ$32:$DU$62,S337)","v":1e-06},0,0,null,{"$f":"IF(U337>'JSM Eingabe+TW'!$CU$92,'JSM Eingabe+TW'!$CU$92,\" \")","v":" "}]
[{"$nulls":18},45,321,{"$f":"LARGE('JSM Eingabe+TW'!$DJ$32:$DU$62,S338)","v":1e-06},{"$f":"IF(T338=V$13,LARGE(U$18:U$382,1),0)","v":0},{"$f":"IF(T338=W$13,LARGE(U$18:U$382,1),0)","v":0},null,{"$f":"IF(U338>'JSM Eingabe+TW'!$CU$92,'JSM Eingabe+TW'!$CU$92,\" \")","v":" "}]
[{"$nulls":18},44,322,{"$f":"LARGE('JSM Eingabe+TW'!$DJ$32:$DU$62,S339)","v":1e-06},0,0,null,{"$f":"IF(U339>'JSM Eingabe+TW'!$CU$92,'JSM Eingabe+TW'!$CU$92,\" \")","v":" "}]
[{"$nulls":18},43,323,{"$f":"LARGE('JSM Eingabe+TW'!$DJ$32:$DU$62,S340)","v":1e-06},0,0,{"$f":"E$31","v":0},{"$f":"IF(U340>'JSM Eingabe+TW'!$CU$92,'JSM Eingabe+TW'!$CU$92,\" \")","v":" "}]
[{"$nulls":18},42,324,{"$f":"LARGE('JSM Eingabe+TW'!$DJ$32:$DU$62,S341)","v":1e-06},0,0,null,{"$f":"IF(U341>'JSM Eingabe+TW'!$CU$92,'JSM Eingabe+TW'!$CU$92,\" \")","v":" "}]
[{"$nulls":18},41,325,{"$f":"LARGE('JSM Eingabe+TW'!$DJ$32:$DU$62,S342)","v":1e-06},0,0,null,{"$f":"IF(U342>'JSM Eingabe+TW'!$CU$92,'JSM Eingabe+TW'!$CU$92,\" \")","v":" "}]
[{"$nulls":18},40,326,{"$f":"LARGE('JSM Eingabe+TW'!$DJ$32:$DU$62,S343)","v":1e-06},0,0,null,{"$f":"IF(U343>'JSM Eingabe+TW'!$CU$92,'JSM Eingabe+TW'!$CU$92,\" \")","v":" "}]
[{"$nulls":18},39,327,{"$f":"LARGE('JSM Eingabe+TW'!$DJ$32:$DU$62,S344)","v":1e-06},0,0,null,{"$f":"IF(U344>'JSM Eingabe+TW'!$CU$92,'JSM Eingabe+TW'!$CU$92,\" \")","v":" "}]
[{"$nulls":18},38,328,{"$f":"LARGE('JSM Eingabe+TW'!$DJ$32:$DU$62,S345)","v":1e-06},0,0,{"$f":"E$31","v":0},{"$f":"IF(U345>'JSM Eingabe+TW'!$CU$92,'JSM Eingabe+TW'!$CU$92,\" \")","v":" "}]
[{"$nulls":18},37,329,{"$f":"LARGE('JSM Eingabe+TW'!$DJ$32:$DU$62,S346)","v":1e-06},0,0,null,{"$f":"IF(U346>'JSM Eingabe+TW'!$CU$92,'JSM Eingabe+TW'!$CU$92,\" \")","v":" "}]
[{"$nulls":18},36,330,{"$f":"LARGE('JSM Eingabe+TW'!$DJ$32:$DU$62,S347)","v":1e-06},0,0,null,{"$f":"IF(U347>'JSM Eingabe+TW'!$CU$92,'JSM Eingabe+TW'!$CU$92,\" \")","v":" "}]
[{"$nulls":18},35,331,{"$f":"LARGE('JSM Eingabe+TW'!$DJ$32:$DU$62,S348)","v":1e-06},0,0,null,{"$f":"IF(U348>'JSM Eingabe+TW'!$CU$92,'JSM Eingabe+TW'!$CU$92,\" \")","v":" "}]
[{"$nulls":18},34,332,{"$f":"LARGE('JSM Eingabe+TW'!$DJ$32:$DU$62,S349)","v":1e-06},0,0,null,{"$f":"IF(U349>'JSM Eingabe+TW'!$CU$92,'JSM Eingabe+TW'!$CU$92,\" \")","v":" "}]
[{"$nulls":18},33,333,{"$f":"LARGE('JSM Eingabe+TW'!$DJ$32:$DU$62,S350)","v":1e-06},0,0,{"$f":"E$31","v":0},{"$f":"IF(U350>'JSM Eingabe+TW'!$CU$92,'JSM Eingabe+TW'!$CU$92,\" \")","v":" "}]
[{"$nulls":18},32,334,{"$f":"LARGE('JSM Eingabe+TW'!$DJ$32:$DU$62,S351)","v":1e-06},0,0,null,{"$f":"IF(U351>'JSM Eingabe+TW'!$CU$92,'JSM Eingabe+TW'!$CU$92,\" \")","v":" "}]
[{"$nulls":18},31,335,{"$f":"LARGE('JSM Eingabe+TW'!$DJ$32:$DU$62,S352)","v":1e-06},0,0,null,{"$f":"IF(U352>'JSM Eingabe+TW'!$CU$92,'JSM Eingabe+TW'!$CU$92,\" \")","v":" "}]
[{"$nulls":18},30,336,{"$f":"LARGE('JSM Eingabe+TW'!$DJ$32:$DU$62,S353)","v":1e-06},0,0,null,{"$f":"IF(U353>'JSM Eingabe+TW'!$CU$92,'JSM Eingabe+TW'!$CU$92,\" \")","v":" "}]
[{"$nulls":18},29,337,{"$f":"LARGE('JSM Eingabe+TW'!$DJ$32:$DU$62,S354)","v":1e-06},0,0,null,{"$f":"IF(U354>'JSM Eingabe+TW'!$CU$92,'JSM Eingabe+TW'!$CU$92,\" \")","v":" "}]
[{"$nulls":18},28,338,{"$f":"LARGE('JSM Eingabe+TW'!$DJ$32:$DU$62,S355)","v":1e-06},0,0,{"$f":"E$31","v":0},{"$f":"IF(U355>'JSM Eingabe+TW'!$CU$92,'JSM Eingabe+TW'!$CU$92,\" \")","v":" "}]
[{"$nulls":18},27,339,{"$f":"LARGE('JSM Eingabe+TW'!$DJ$32:$DU$62,S356)","v":1e-06},0,0,null,{"$f":"IF(U356>'JSM Eingabe+TW'!$CU$92,'JSM Eingabe+TW'!$CU$92,\" \")","v":" "}]
[{"$nulls":18},26,340,{"$f":"LARGE('JSM Eingabe+TW'!$DJ$32:$DU$62,S357)","v":1e-06},0,0,null,{"$f":"IF(U357>'JSM Eingabe+TW'!$CU$92,'JSM Eingabe+TW'!$CU$92,\" \")","v":" "}]
[{"$nulls":18},25,341,{"$f":"LARGE('JSM Eingabe+TW'!$DJ$32:$DU$62,S358)","v":1e-06},0,0,null,{"$f":"IF(U358>'JSM Eingabe+TW'!$CU$92,'JSM Eingabe+TW'!$CU$92,\" \")","v":" "}]
[{"$nulls":18},24,342,{"$f":"LARGE('JSM Eingabe+TW'!$DJ$32:$DU$62,S359)","v":1e-06},0,0,null,{"$f":"IF(U359>'JSM Eingabe+TW'!$CU$92,'JSM Eingabe+TW'!$CU$92,\" \")","v":" "}]
[{"$nulls":18},23,343,{"$f":"LARGE('JSM Eingabe+TW'!$DJ$32:$DU$62,S360)","v":1e-06},0,0,{"$f":"E$31","v":0},{"$f":"IF(U360>'JSM Eingabe+TW'!$CU$92,'JSM Eingabe+TW'!$CU$92,\" \")","v":" "}]
[{"$nulls":18},22,344,{"$f":"LARGE('JSM Eingabe+TW'!$DJ$32:$DU$62,S361)","v":1e-06},0,0,null,{"$f":"IF(U361>'JSM Eingabe+TW'!$CU$92,'JSM Eingabe+TW'!$CU$92,\" \")","v":" "}]
[{"$nulls":18},21,345,{"$f":"LARGE('JSM Eingabe+TW'!$DJ$32:$DU$62,S362)","v":1e-06},0,0,null,{"$f":"IF(U362>'JSM Eingabe+TW'!$CU$92,'JSM Eingabe+TW'!$CU$92,\" \")","v":" "}]
[{"$nulls":18},20,346,{"$f":"LARGE('JSM Eingabe+TW'!$DJ$32:$DU$62,S363)","v":1e-06},0,0,null,{"$f":"IF(U363>'JSM Eingabe+TW'!$CU$92,'JSM Eingabe+TW'!$CU$92,\" \")","v":" "}]
[{"$nulls":18},19,347,{"$f":"LARGE('JSM Eingabe+TW'!$DJ$32:$DU$62,S364)","v":1e-06},0,0,null,{"$f":"IF(U364>'JSM Eingabe+TW'!$CU$92,'JSM Eingabe+TW'!$CU$92,\" \")","v":" "}]
[{"$nulls":18},18,348,{"$f":"LARGE('JSM Eingabe+TW'!$DJ$32:$DU$62,S365)","v":1e-06},0,0,{"$f":"E$31","v":0},{"$f":"IF(U365>'JSM Eingabe+TW'!$CU$92,'JSM Eingabe+TW'!$CU$92,\" \")","v":" "}]
[{"$nulls":18},17,349,{"$f":"LARGE('JSM Eingabe+TW'!$DJ$32:$DU$62,S366)","v":1e-06},0,0,null,{"$f":"IF(U366>'JSM Eingabe+TW'!$CU$92,'JSM Eingabe+TW'!$CU$92,\" \")","v":" "}]
[{"$nulls":18},16,350,{"$f":"LARGE('JSM Eingabe+TW'!$DJ$32:$DU$62,S367)","v":1e-06},0,0,null,{"$f":"IF(U367>'JSM Eingabe+TW'!$CU$92,'JSM Eingabe+TW'!$CU$92,\" \")","v":" "}]
[{"$nulls":18},15,351,{"$f":"LARGE('JSM Eingabe+TW'!$DJ$32:$DU$62,S368)","v":1e-06},0,0,null,{"$f":"IF(U368>'JSM Eingabe+TW'!$CU$92,'JSM Eingabe+TW'!$CU$92,\" \")","v":" "}]
[{"$nulls":18},14,352,{"$f":"LARGE('JSM Eingabe+TW'!$DJ$32:$DU$62,S369)","v":1e-06},0,0,null,{"$f":"IF(U369>'JSM Eingabe+TW'!$CU$92,'JSM Eingabe+TW'!$CU$92,\" \")","v":" "}]
[{"$nulls":18},13,353,{"$f":"LARGE('JSM Eingabe+TW'!$DJ$32:$DU$62,S370)","v":1e-06},0,0,{"$f":"E$31","v":0},{"$f":"IF(U370>'JSM Eingabe+TW'!$CU$92,'JSM Eingabe+TW'!$CU$92,\" \")","v":" "}]
[{"$nulls":18},12,354,{"$f":"LARGE('JSM Eingabe+TW'!$DJ$32:$DU$62,S371)","v":1e-06},0,0,null,{"$f":"IF(U371>'JSM Eingabe+TW'!$CU$92,'JSM Eingabe+TW'!$CU$92,\" \")","v":" "}]
[{"$nulls":18},11,355,{"$f":"LARGE('JSM Eingabe+TW'!$DJ$32:$DU$62,S372)","v":1e-06},0,0,null,{"$f":"IF(U372>'JSM Eingabe+TW'!$CU$92,'JSM Eingabe+TW'!$CU$92,\" \")","v":" "}]
[{"$nulls":18},10,356,{"$f":"LARGE('JSM Eingabe+TW'!$DJ$32:$DU$62,S373)","v":1e-06},0,0,null,{"$f":"IF(U373>'JSM Eingabe+TW'!$CU$92,'JSM Eingabe+TW'!$CU$92,\" \")","v":" "}]
[{"$nulls":18},9,357,{"$f":"LARGE('JSM Eingabe+TW'!$DJ$32:$DU$62,S374)","v":1e-06},0,0,null,{"$f":"IF(U374>'JSM Eingabe+TW'!$CU$92,'JSM Eingabe+TW'!$CU$92,\" \")","v":" "}]
[{"$nulls":18},8,358,{"$f":"LARGE('JSM Eingabe+TW'!$DJ$32:$DU$62,S375)","v":1e-06},0,0,{"$f":"E$31","v":0},{"$f":"IF(U375>'JSM Eingabe+TW'!$CU$92,'JSM Eingabe+TW'!$CU$92,\" \")","v":" "}]
[{"$nulls":18},7,359,{"$f":"LARGE('JSM Eingabe+TW'!$DJ$32:$DU$62,S376)","v":1e-06},0,0,null,{"$f":"IF(U376>'JSM Eingabe+TW'!$CU$92,'JSM Eingabe+TW'!$CU$92,\" \")","v":" "}]
[{"$nulls":18},6,360,{"$f":"LARGE('JSM Eingabe+TW'!$DJ$32:$DU$62,S377)","v":1e-06},0,0,null,{"$f":"IF(U377>'JSM Eingabe+TW'!$CU$92,'JSM Eingabe+TW'!$CU$92,\" \")","v":" "}]
[{"$nulls":18},5,361,{"$f":"LARGE('JSM Eingabe+TW'!$DJ$32:$DU$62,S378)","v":1e-06},0,0,null,{"$f":"IF(U378>'JSM Eingabe+TW'!$CU$92,'JSM Eingabe+TW'!$CU$92,\" \")","v":" "}]
[{"$nulls":18},4,362,{"$f":"LARGE('JSM Eingabe+TW'!$DJ$32:$DU$62,S379)","v":1e-06},0,0,null,{"$f":"IF(U379>'JSM Eingabe+TW'!$CU$92,'JSM Eingabe+TW'!$CU$92,\" \")","v":" "}]
[{"$nulls":18},3,363,{"$f":"LARGE('JSM Eingabe+TW'!$DJ$32:$DU$62,S380)","v":1e-06},0,0,{"$f":"E$31","v":0},{"$f":"IF(U380>'JSM Eingabe+TW'!$CU$92,'JSM Eingabe+TW'!$CU$92,\" \")","v":" "}]
[{"$nulls":18},2,364,{"$f":"LARGE('JSM Eingabe+TW'!$DJ$32:$DU$62,S381)","v":1e-06},0,0,null,{"$f":"IF(U381>'JSM Eingabe+TW'!$CU$92,'JSM Eingabe+TW'!$CU$92,\" \")","v":" "}]
[{"$nulls":18},1,365,{"$f":"LARGE('JSM Eingabe+TW'!$DJ$32:$DU$62,S382)","v":1e-06},0,0,null,{"$f":"IF(U382>'JSM Eingabe+TW'!$CU$92,'JSM Eingabe+TW'!$CU$92,\" \")","v":" "}]
[]
[]
[{"$nulls":20},{"$f":"SUM(U20:U382)","v":{"v":3.6300000000000232E-4,"d":"0"}}]

{"sheet":"JSM FW Dreieck","index":14,"n_rows":385,"n_cols":28,"rows_kept":385,"merged":[[11,3,13,3],[11,4,13,5],[16,1,16,3],[17,1,17,3],[19,1,19,3],[20,1,20,3],[21,1,21,3],[22,2,22,3],[24,1,24,3],[25,1,25,3],[27,1,27,3],[28,1,28,3],[29,1,29,3],[33,8,33,12],[34,9,35,12],[34,13,35,13],[34,14,35,14],[34,15,35,15],[34,16,35,16]]}
[]
[null,{"$f":"'JSM Eingabe+TW'!B2","v":"Ergebnisse der Selbstüberwachung"},{"$nulls":13},"Berichtsjahr :",{"$f":"IF(LEN('JSM Eingabe+TW'!AB7)>0,'JSM Eingabe+TW'!AB7,\"\")","v":""}]
[]
[]
[null,{"$f":"'JSM Eingabe+TW'!B5","v":"Ermittlung der Jahresschmutzwassermenge (JSM) und des Fremdwassers (QF)"},{"$nulls":14},"Blatt 3"]
[]
[null,"Kläranlage :",{"$f":"IF(LEN('JSM Eingabe+TW'!D7)>0,'JSM Eingabe+TW'!D7,\"\")","v":""},{"$nulls":4},"VG / Stadt:  ",{"$f":"IF(LEN('JSM Eingabe+TW'!M7)>0,'JSM Eingabe+TW'!M7,\"\")","v":""},{"$nulls":7},{"$f":"'JSM Eingabe+TW'!AB2","v":"Programmversion 7.3.9"}]
[]
[null,"Fremdwassermenge über die Dreiecksmethode"]
[]
[]
[{"$nulls":3},"INFO- Feld mit dem Mauszeiger anfahren","INFO",{"$nulls":17},{"$f":"E30*2","v":0}]
[{"$nulls":21},{"$f":"ROUND(E30,0)","v":0},{"$f":"ROUND(W12,0)","v":0},{"$nulls":3},{"$f":"COUNTIF(AA18:AA382,\">1\")","v":0}]
[]
[{"$nulls":20},{"$f":"SUMIF(W18:W382,W15,U18:U382)","v":3.6500000000000237E-4},null,{"$f":"SUM(W18:W382)","v":0},null,{"$f":"SUM(Y18:Y382)","v":0.06679500000000044}]
[]
[null,"ausgewertete Betriebsdaten:",{"$nulls":18},"Abfluss","mittl. TW","TW/RW","mittl. FW","Fremdwasser","Frischwasser"]
[null,"mittlerer Tageswert des Jahres",null,null,{"$f":"'JSM Eingabe+TW'!I102","v":""},"m³/d",{"$nulls":12},365,1,{"$f":"LARGE('JSM Eingabe+TW'!$DJ$32:$DU$62,S18)","v":1e-06},{"$f":"IF(T18=V$13,LARGE(U$18:U$382,1),0)","v":0},{"$f":"IF(T18=W$13,LARGE(U$18:U$382,1),0)","v":0},{"$f":"P$35","v":{"v":1.830000000000012E-4,"d":"0"}},{"$f":"IF(T18<=$W$13,U18,((U$15-P$34)/(365-W$13)*AB18)+P$34)","v":3.6500000000000237E-4},null,{"$f":"IF(U18>'JSM Eingabe+TW'!$CU$92,'JSM Eingabe+TW'!$CU$92,\" \")","v":" "},{"$f":"IF(T18<=W$13,0,S18)","v":365}]
[{"$nulls":3},"Kleinstwert",{"$f":"'JSM Eingabe+TW'!M102","v":""},"m³/d",{"$nulls":12},364,2,{"$f":"LARGE('JSM Eingabe+TW'!$DJ$32:$DU$62,S19)","v":1e-06},0,0,{"v":1.830000000000012E-4,"d":"0"},3.640000000000024E-4,{"$f":"P$34","v":0},{"$f":"IF(U19>'JSM Eingabe+TW'!$CU$92,'JSM Eingabe+TW'!$CU$92,\" \")","v":" "},{"$f":"IF(T19<=W$13,0,S19)","v":364}]
[null,"Mittelwert (ohne Hochwasser)",null,null,{"$f":"'JSM Eingabe+TW'!Q102","v":""},"m³/d",{"$nulls":12},363,3,{"$f":"LARGE('JSM Eingabe+TW'!$DJ$32:$DU$62,S20)","v":1e-06},0,0,{"v":1.830000000000012E-4,"d":"0"},3.6300000000000237E-4,null,{"$f":"IF(U20>'JSM Eingabe+TW'!$CU$92,'JSM Eingabe+TW'!$CU$92,\" \")","v":" "},363]
[null,"größtes Trockenwetter (TW):",null,null,{"$f":"'JSM Eingabe+TW'!I103","v":""},"m³/d",{"$nulls":12},362,4,{"$f":"LARGE('JSM Eingabe+TW'!$DJ$32:$DU$62,S21)","v":1e-06},0,0,{"v":1.830000000000012E-4,"d":"0"},3.6200000000000235E-4,null,{"$f":"IF(U21>'JSM Eingabe+TW'!$CU$92,'JSM Eingabe+TW'!$CU$92,\" \")","v":" "},362]
[null,"kleinstes TW:",null,null,{"$f":"'JSM Eingabe+TW'!M103","v":""},"m³/d",{"$nulls":12},361,5,{"$f":"LARGE('JSM Eingabe+TW'!$DJ$32:$DU$62,S22)","v":1e-06},0,0,{"v":1.830000000000012E-4,"d":"0"},3.6100000000000238E-4,null,{"$f":"IF(U22>'JSM Eingabe+TW'!$CU$92,'JSM Eingabe+TW'!$CU$92,\" \")","v":" "},361]
[null,null,"mittleres TW:",null,{"$f":"'JSM Eingabe+TW'!Q103","v":{"v":1e-06,"d":"0"}},"m³/d",{"$nulls":12},360,6,{"$f":"LARGE('JSM Eingabe+TW'!$DJ$32:$DU$62,S23)","v":1e-06},0,0,{"v":1.830000000000012E-4,"d":"0"},3.6000000000000235E-4,null,{"$f":"IF(U23>'JSM Eingabe+TW'!$CU$92,'JSM Eingabe+TW'!$CU$92,\" \")","v":" "},360]
[{"$nulls":18},359,7,{"$f":"LARGE('JSM Eingabe+TW'!$DJ$32:$DU$62,S24)","v":1e-06},0,0,{"v":1.830000000000012E-4,"d":"0"},3.5900000000000233E-4,{"$f":"P$34","v":0},{"$f":"IF(U24>'JSM Eingabe+TW'!$CU$92,'JSM Eingabe+TW'!$CU$92,\" \")","v":" "},359]
[null,"Anzahl fehlender Einträge / Hochwassertage",null,null,{"$f":"'JSM Eingabe+TW'!N104","v":365},"d",{"$nulls":12},358,8,{"$f":"LARGE('JSM Eingabe+TW'!$DJ$32:$DU$62,S25)","v":1e-06},0,0,{"v":1.830000000000012E-4,"d":"0"},3.5800000000000236E-4,null,{"$f":"IF(U25>'JSM Eingabe+TW'!$CU$92,'JSM Eingabe+TW'!$CU$92,\" \")","v":" "},358]
[null,{"$f":"IF('JSM Eingabe+TW'!DX18>0,\"Für fehlende Einträge und für Hochwassertage wird folgender Ersatzwert berücksichtigt:\",\" \")","v":"Für fehlende Einträge und für Hochwassertage wird folgender Ersatzwert berücksichtigt:"},null,null,{"$f":"'JSM Jahresdauerlinie'!E26","v":{"v":1e-06,"d":"0 "}},{"$f":"IF('JSM Eingabe+TW'!DX18>0,\"m³/d\",\" \")","v":"m³/d"},{"$nulls":12},357,9,{"$f":"LARGE('JSM Eingabe+TW'!$DJ$32:$DU$62,S26)","v":1e-06},0,0,{"v":1.830000000000012E-4,"d":"0"},3.5700000000000233E-4,null,{"$f":"IF(U26>'JSM Eingabe+TW'!$CU$92,'JSM Eingabe+TW'!$CU$92,\" \")","v":" "},357]
[{"$nulls":18},356,10,{"$f":"LARGE('JSM Eingabe+TW'!$DJ$32:$DU$62,S27)","v":1e-06},0,0,{"v":1.830000000000012E-4,"d":"0"},3.5600000000000231E-4,null,{"$f":"IF(U27>'JSM Eingabe+TW'!$CU$92,'JSM Eingabe+TW'!$CU$92,\" \")","v":" "},356]
[null,"Auswertung der Jahresdauerlinie:",{"$nulls":16},355,11,{"$f":"LARGE('JSM Eingabe+TW'!$DJ$32:$DU$62,S28)","v":1e-06},0,0,{"v":1.830000000000012E-4,"d":"0"},3.5500000000000234E-4,null,{"$f":"IF(U28>'JSM Eingabe+TW'!$CU$92,'JSM Eingabe+TW'!$CU$92,\" \")","v":" "},355]
[null,"Anzahl der TW-Tage nach Betriebstagebuch",null,null,{"$f":"'JSM Eingabe+TW'!AB64","v":0},"d","(bis zur roten Linie)",{"$nulls":11},354,12,{"$f":"LARGE('JSM Eingabe+TW'!$DJ$32:$DU$62,S29)","v":1e-06},0,0,{"v":1.830000000000012E-4,"d":"0"},3.5400000000000232E-4,{"$f":"P$34","v":0},{"$f":"IF(U29>'JSM Eingabe+TW'!$CU$92,'JSM Eingabe+TW'!$CU$92,\" \")","v":" "},354]
[null,"Hälfte der Anzahl der TW-Tage",null,null,{"$f":"E29/2","v":{"v":0,"d":"0.0"}},"d",{"$nulls":12},353,13,{"$f":"LARGE('JSM Eingabe+TW'!$DJ$32:$DU$62,S30)","v":1e-06},0,0,{"v":1.830000000000012E-4,"d":"0"},3.5300000000000229E-4,null,{"$f":"IF(U30>'JSM Eingabe+TW'!$CU$92,'JSM Eingabe+TW'!$CU$92,\" \")","v":" "},353]
[{"$nulls":18},352,14,{"$f":"LARGE('JSM Eingabe+TW'!$DJ$32:$DU$62,S31)","v":1e-06},0,0,{"v":1.830000000000012E-4,"d":"0"},3.5200000000000227E-4,null,{"$f":"IF(U31>'JSM Eingabe+TW'!$CU$92,'JSM Eingabe+TW'!$CU$92,\" \")","v":" "},352]
[{"$nulls":18},351,15,{"$f":"LARGE('JSM Eingabe+TW'!$DJ$32:$DU$62,S32)","v":1e-06},0,0,{"v":1.830000000000012E-4,"d":"0"},3.510000000000023E-4,null,{"$f":"IF(U32>'JSM Eingabe+TW'!$CU$92,'JSM Eingabe+TW'!$CU$92,\" \")","v":" "},351]
[{"$nulls":18},350,16,{"$f":"LARGE('JSM Eingabe+TW'!$DJ$32:$DU$62,S33)","v":1e-06},0,0,{"v":1.830000000000012E-4,"d":"0"},3.5000000000000227E-4,null,{"$f":"IF(U33>'JSM Eingabe+TW'!$CU$92,'JSM Eingabe+TW'!$CU$92,\" \")","v":" "},350]
[{"$nulls":8},"Schmutzwasser nach Wasserverbrauch (blau getrichelt)",{"$nulls":4},{"$f":"'JSM Eingabe+TW'!S18","v":0},"m³ / a  =",{"$f":"'JSM Eingabe+TW'!S18/365","v":0},"m³/d",null,349,17,{"$f":"LARGE('JSM Eingabe+TW'!$DJ$32:$DU$62,S34)","v":1e-06},0,0,{"v":1.830000000000012E-4,"d":"0"},3.4900000000000225E-4,{"$f":"P$34","v":0},null,349]
[{"$nulls":8},"Fremdwasser","(dreiecksförmige graue Fläche oberhalb der blauen Fläche des Schmutzwassers)",{"$nulls":3},{"$f":"Y15-P34*'JSM Eingabe+TW'!AF65","v":{"v":0.06679500000000044,"d":"0 "}},"m³ / a  =",{"$f":"Y15/365","v":{"v":1.830000000000012E-4,"d":"0 "}},"m³/d",null,348,18,{"$f":"LARGE('JSM Eingabe+TW'!$DJ$32:$DU$62,S35)","v":1e-06},0,0,{"v":1.830000000000012E-4,"d":"0"},3.4800000000000228E-4,null,null,348]
[{"$nulls":18},347,19,{"$f":"LARGE('JSM Eingabe+TW'!$DJ$32:$DU$62,S36)","v":1e-06},0,0,{"v":1.830000000000012E-4,"d":"0"},3.4700000000000225E-4,null,null,347]
[{"$nulls":9},"Jahresschmutzwassermenge",null,null,"(Fremdwasser + Wasserverbr.)",{"$f":"N35+'JSM Eingabe+TW'!S18","v":{"v":0.06679500000000044,"d":"0 "}},"m³ / a    ",{"$nulls":3},346,20,{"$f":"LARGE('JSM Eingabe+TW'!$DJ$32:$DU$62,S37)","v":1e-06},0,0,{"v":1.830000000000012E-4,"d":"0"},3.4600000000000223E-4,null,null,346]
[{"$nulls":12},"Fremdwasseranteil der festgestellten JSM",{"$f":"N35/N37*100","v":{"v":100,"d":"100.0 "}},"%",{"$nulls":3},345,21,{"$f":"LARGE('JSM Eingabe+TW'!$DJ$32:$DU$62,S38)","v":1e-06},0,0,{"v":1.830000000000012E-4,"d":"0"},3.4500000000000226E-4,null,{"$f":"IF(U38>'JSM Eingabe+TW'!$CU$92,'JSM Eingabe+TW'!$CU$92,\" \")","v":" "},345]
[{"$nulls":18},344,22,{"$f":"LARGE('JSM Eingabe+TW'!$DJ$32:$DU$62,S39)","v":1e-06},0,0,{"v":1.830000000000012E-4,"d":"0"},3.4400000000000224E-4,{"$f":"P$34","v":0},null,344]
[{"$nulls":18},343,23,{"$f":"LARGE('JSM Eingabe+TW'!$DJ$32:$DU$62,S40)","v":1e-06},0,0,{"v":1.830000000000012E-4,"d":"0"},3.4300000000000221E-4,null,null,343]
[{"$nulls":9},{"$f":"IF(AA13>0,\"Der schwarz liniierte Bereich am rechten Rand liegt ausserhalb des Betrachtungsbereichs (fehlende Daten)\",\" \")","v":" "},{"$nulls":8},342,24,{"$f":"LARGE('JSM Eingabe+TW'!$DJ$32:$DU$62,S41)","v":1e-06},0,0,{"v":1.830000000000012E-4,"d":"0"},3.4200000000000224E-4,null,{"$f":"IF(U41>'JSM Eingabe+TW'!$CU$92,'JSM Eingabe+TW'!$CU$92,\" \")","v":" "},342]
[{"$nulls":18},341,25,{"$f":"LARGE('JSM Eingabe+TW'!$DJ$32:$DU$62,S42)","v":1e-06},0,0,{"v":1.830000000000012E-4,"d":"0"},3.4100000000000222E-4,null,{"$f":"IF(U42>'JSM Eingabe+TW'!$CU$92,'JSM Eingabe+TW'!$CU$92,\" \")","v":" "},341]
[{"$nulls":18},340,26,{"$f":"LARGE('JSM Eingabe+TW'!$DJ$32:$DU$62,S43)","v":1e-06},0,0,{"v":1.830000000000012E-4,"d":"0"},3.4000000000000219E-4,null,{"$f":"IF(U43>'JSM Eingabe+TW'!$CU$92,'JSM Eingabe+TW'!$CU$92,\" \")","v":" "},340]
[{"$nulls":18},339,27,{"$f":"LARGE('JSM Eingabe+TW'!$DJ$32:$DU$62,S44)","v":1e-06},0,0,{"v":1.830000000000012E-4,"d":"0"},3.3900000000000222E-4,{"$f":"P$34","v":0},{"$f":"IF(U44>'JSM Eingabe+TW'!$CU$92,'JSM Eingabe+TW'!$CU$92,\" \")","v":" "},339]
[{"$nulls":18},338,28,{"$f":"LARGE('JSM Eingabe+TW'!$DJ$32:$DU$62,S45)","v":1e-06},0,0,{"v":1.830000000000012E-4,"d":"0"},3.380000000000022E-4,null,{"$f":"IF(U45>'JSM Eingabe+TW'!$CU$92,'JSM Eingabe+TW'!$CU$92,\" \")","v":" "},338]
[{"$nulls":18},337,29,{"$f":"LARGE('JSM Eingabe+TW'!$DJ$32:$DU$62,S46)","v":1e-06},0,0,{"v":1.830000000000012E-4,"d":"0"},3.3700000000000217E-4,null,{"$f":"IF(U46>'JSM Eingabe+TW'!$CU$92,'JSM Eingabe+TW'!$CU$92,\" \")","v":" "},337]
[{"$nulls":18},336,30,{"$f":"LARGE('JSM Eingabe+TW'!$DJ$32:$DU$62,S47)","v":1e-06},0,0,{"v":1.830000000000012E-4,"d":"0"},3.360000000000022E-4,null,{"$f":"IF(U47>'JSM Eingabe+TW'!$CU$92,'JSM Eingabe+TW'!$CU$92,\" \")","v":" "},336]
[{"$nulls":18},335,31,{"$f":"LARGE('JSM Eingabe+TW'!$DJ$32:$DU$62,S48)","v":1e-06},0,0,{"v":1.830000000000012E-4,"d":"0"},3.3500000000000218E-4,null,{"$f":"IF(U48>'JSM Eingabe+TW'!$CU$92,'JSM Eingabe+TW'!$CU$92,\" \")","v":" "},335]
[{"$nulls":18},334,32,{"$f":"LARGE('JSM Eingabe+TW'!$DJ$32:$DU$62,S49)","v":1e-06},0,0,{"v":1.830000000000012E-4,"d":"0"},3.3400000000000216E-4,{"$f":"P$34","v":0},{"$f":"IF(U49>'JSM Eingabe+TW'!$CU$92,'JSM Eingabe+TW'!$CU$92,\" \")","v":" "},334]
[{"$nulls":18},333,33,{"$f":"LARGE('JSM Eingabe+TW'!$DJ$32:$DU$62,S50)","v":1e-06},0,0,{"v":1.830000000000012E-4,"d":"0"},3.3300000000000219E-4,null,{"$f":"IF(U50>'JSM Eingabe+TW'!$CU$92,'JSM Eingabe+TW'!$CU$92,\" \")","v":" "},333]
[{"$nulls":18},332,34,{"$f":"LARGE('JSM Eingabe+TW'!$DJ$32:$DU$62,S51)","v":1e-06},0,0,{"v":1.830000000000012E-4,"d":"0"},3.3200000000000216E-4,null,{"$f":"IF(U51>'JSM Eingabe+TW'!$CU$92,'JSM Eingabe+TW'!$CU$92,\" \")","v":" "},332]
[{"$nulls":18},331,35,{"$f":"LARGE('JSM Eingabe+TW'!$DJ$32:$DU$62,S52)","v":1e-06},0,0,{"v":1.830000000000012E-4,"d":"0"},3.3100000000000214E-4,null,{"$f":"IF(U52>'JSM Eingabe+TW'!$CU$92,'JSM Eingabe+TW'!$CU$92,\" \")","v":" "},331]
[{"$nulls":18},330,36,{"$f":"LARGE('JSM Eingabe+TW'!$DJ$32:$DU$62,S53)","v":1e-06},0,0,{"v":1.830000000000012E-4,"d":"0"},3.3000000000000217E-4,null,{"$f":"IF(U53>'JSM Eingabe+TW'!$CU$92,'JSM Eingabe+TW'!$CU$92,\" \")","v":" "},330]
[{"$nulls":18},329,37,{"$f":"LARGE('JSM Eingabe+TW'!$DJ$32:$DU$62,S54)","v":1e-06},0,0,{"v":1.830000000000012E-4,"d":"0"},3.2900000000000214E-4,{"$f":"P$34","v":0},{"$f":"IF(U54>'JSM Eingabe+TW'!$CU$92,'JSM Eingabe+TW'!$CU$92,\" \")","v":" "},329]
[{"$nulls":18},328,38,{"$f":"LARGE('JSM Eingabe+TW'!$DJ$32:$DU$62,S55)","v":1e-06},0,0,{"v":1.830000000000012E-4,"d":"0"},3.2800000000000212E-4,null,{"$f":"IF(U55>'JSM Eingabe+TW'!$CU$92,'JSM Eingabe+TW'!$CU$92,\" \")","v":" "},328]
[{"$nulls":18},327,39,{"$f":"LARGE('JSM Eingabe+TW'!$DJ$32:$DU$62,S56)","v":1e-06},0,0,{"v":1.830000000000012E-4,"d":"0"},3.2700000000000215E-4,null,{"$f":"IF(U56>'JSM Eingabe+TW'!$CU$92,'JSM Eingabe+TW'!$CU$92,\" \")","v":" "},327]
[{"$nulls":18},326,40,{"$f":"LARGE('JSM Eingabe+TW'!$DJ$32:$DU$62,S57)","v":1e-06},0,0,{"v":1.830000000000012E-4,"d":"0"},3.2600000000000212E-4,null,{"$f":"IF(U57>'JSM Eingabe+TW'!$CU$92,'JSM Eingabe+TW'!$CU$92,\" \")","v":" "},326]
[{"$nulls":18},325,41,{"$f":"LARGE('JSM Eingabe+TW'!$DJ$32:$DU$62,S58)","v":1e-06},0,0,{"v":1.830000000000012E-4,"d":"0"},3.250000000000021E-4,null,{"$f":"IF(U58>'JSM Eingabe+TW'!$CU$92,'JSM Eingabe+TW'!$CU$92,\" \")","v":" "},325]
[{"$nulls":18},324,42,{"$f":"LARGE('JSM Eingabe+TW'!$DJ$32:$DU$62,S59)","v":1e-06},0,0,{"v":1.830000000000012E-4,"d":"0"},3.2400000000000213E-4,{"$f":"P$34","v":0},{"$f":"IF(U59>'JSM Eingabe+TW'!$CU$92,'JSM Eingabe+TW'!$CU$92,\" \")","v":" "},324]
[{"$nulls":18},323,43,{"$f":"LARGE('JSM Eingabe+TW'!$DJ$32:$DU$62,S60)","v":1e-06},0,0,{"v":1.830000000000012E-4,"d":"0"},3.230000000000021E-4,null,{"$f":"IF(U60>'JSM Eingabe+TW'!$CU$92,'JSM Eingabe+TW'!$CU$92,\" \")","v":" "},323]
[{"$nulls":18},322,44,{"$f":"LARGE('JSM Eingabe+TW'!$DJ$32:$DU$62,S61)","v":1e-06},0,0,{"v":1.830000000000012E-4,"d":"0"},3.2200000000000208E-4,null,{"$f":"IF(U61>'JSM Eingabe+TW'!$CU$92,'JSM Eingabe+TW'!$CU$92,\" \")","v":" "},322]
[{"$nulls":18},321,45,{"$f":"LARGE('JSM Eingabe+TW'!$DJ$32:$DU$62,S62)","v":1e-06},0,0,{"v":1.830000000000012E-4,"d":"0"},3.2100000000000211E-4,null,{"$f":"IF(U62>'JSM Eingabe+TW'!$CU$92,'JSM Eingabe+TW'!$CU$92,\" \")","v":" "},321]
[{"$nulls":18},320,46,{"$f":"LARGE('JSM Eingabe+TW'!$DJ$32:$DU$62,S63)","v":1e-06},0,0,{"v":1.830000000000012E-4,"d":"0"},3.2000000000000209E-4,null,{"$f":"IF(U63>'JSM Eingabe+TW'!$CU$92,'JSM Eingabe+TW'!$CU$92,\" \")","v":" "},320]
[{"$nulls":18},319,47,{"$f":"LARGE('JSM Eingabe+TW'!$DJ$32:$DU$62,S64)","v":1e-06},0,0,{"v":1.830000000000012E-4,"d":"0"},3.1900000000000206E-4,{"$f":"P$34","v":0},{"$f":"IF(U64>'JSM Eingabe+TW'!$CU$92,'JSM Eingabe+TW'!$CU$92,\" \")","v":" "},319]
[{"$nulls":18},318,48,{"$f":"LARGE('JSM Eingabe+TW'!$DJ$32:$DU$62,S65)","v":1e-06},0,0,{"v":1.830000000000012E-4,"d":"0"},3.1800000000000209E-4,null,{"$f":"IF(U65>'JSM Eingabe+TW'!$CU$92,'JSM Eingabe+TW'!$CU$92,\" \")","v":" "},318]
[{"$nulls":18},317,49,{"$f":"LARGE('JSM Eingabe+TW'!$DJ$32:$DU$62,S66)","v":1e-06},0,0,{"v":1.830000000000012E-4,"d":"0"},3.1700000000000207E-4,null,{"$f":"IF(U66>'JSM Eingabe+TW'!$CU$92,'JSM Eingabe+TW'!$CU$92,\" \")","v":" "},317]
[{"$nulls":18},316,50,{"$f":"LARGE('JSM Eingabe+TW'!$DJ$32:$DU$62,S67)","v":1e-06},0,0,{"v":1.830000000000012E-4,"d":"0"},3.1600000000000204E-4,null,{"$f":"IF(U67>'JSM Eingabe+TW'!$CU$92,'JSM Eingabe+TW'!$CU$92,\" \")","v":" "},316]
[{"$nulls":18},315,51,{"$f":"LARGE('JSM Eingabe+TW'!$DJ$32:$DU$62,S68)","v":1e-06},0,0,{"v":1.830000000000012E-4,"d":"0"},3.1500000000000207E-4,null,{"$f":"IF(U68>'JSM Eingabe+TW'!$CU$92,'JSM Eingabe+TW'!$CU$92,\" \")","v":" "},315]
[{"$nulls":18},314,52,{"$f":"LARGE('JSM Eingabe+TW'!$DJ$32:$DU$62,S69)","v":1e-06},0,0,{"v":1.830000000000012E-4,"d":"0"},3.1400000000000205E-4,{"$f":"P$34","v":0},{"$f":"IF(U69>'JSM Eingabe+TW'!$CU$92,'JSM Eingabe+TW'!$CU$92,\" \")","v":" "},314]
[{"$nulls":18},313,53,{"$f":"LARGE('JSM Eingabe+TW'!$DJ$32:$DU$62,S70)","v":1e-06},0,0,{"v":1.830000000000012E-4,"d":"0"},0.000313000000000002,null,{"$f":"IF(U70>'JSM Eingabe+TW'!$CU$92,'JSM Eingabe+TW'!$CU$92,\" \")","v":" "},313]
[{"$nulls":18},312,54,{"$f":"LARGE('JSM Eingabe+TW'!$DJ$32:$DU$62,S71)","v":1e-06},0,0,{"v":1.830000000000012E-4,"d":"0"},3.1200000000000205E-4,null,{"$f":"IF(U71>'JSM Eingabe+TW'!$CU$92,'JSM Eingabe+TW'!$CU$92,\" \")","v":" "},312]
[{"$nulls":18},311,55,{"$f":"LARGE('JSM Eingabe+TW'!$DJ$32:$DU$62,S72)","v":1e-06},0,0,{"v":1.830000000000012E-4,"d":"0"},3.1100000000000203E-4,null,{"$f":"IF(U72>'JSM Eingabe+TW'!$CU$92,'JSM Eingabe+TW'!$CU$92,\" \")","v":" "},311]
[{"$nulls":18},310,56,{"$f":"LARGE('JSM Eingabe+TW'!$DJ$32:$DU$62,S73)","v":1e-06},0,0,{"v":1.830000000000012E-4,"d":"0"},0.000310000000000002,null,{"$f":"IF(U73>'JSM Eingabe+TW'!$CU$92,'JSM Eingabe+TW'!$CU$92,\" \")","v":" "},310]
[{"$nulls":18},309,57,{"$f":"LARGE('JSM Eingabe+TW'!$DJ$32:$DU$62,S74)","v":1e-06},0,0,{"v":1.830000000000012E-4,"d":"0"},3.0900000000000204E-4,{"$f":"P$34","v":0},{"$f":"IF(U74>'JSM Eingabe+TW'!$CU$92,'JSM Eingabe+TW'!$CU$92,\" \")","v":" "},309]
[{"$nulls":18},308,58,{"$f":"LARGE('JSM Eingabe+TW'!$DJ$32:$DU$62,S75)","v":1e-06},0,0,{"v":1.830000000000012E-4,"d":"0"},0.000308000000000002,null,{"$f":"IF(U75>'JSM Eingabe+TW'!$CU$92,'JSM Eingabe+TW'!$CU$92,\" \")","v":" "},308]
[{"$nulls":18},307,59,{"$f":"LARGE('JSM Eingabe+TW'!$DJ$32:$DU$62,S76)","v":1e-06},0,0,{"v":1.830000000000012E-4,"d":"0"},0.000307000000000002,null,{"$f":"IF(U76>'JSM Eingabe+TW'!$CU$92,'JSM Eingabe+TW'!$CU$92,\" \")","v":" "},307]
[{"$nulls":18},306,60,{"$f":"LARGE('JSM Eingabe+TW'!$DJ$32:$DU$62,S77)","v":1e-06},0,0,{"v":1.830000000000012E-4,"d":"0"},0.000306000000000002,null,{"$f":"IF(U77>'JSM Eingabe+TW'!$CU$92,'JSM Eingabe+TW'!$CU$92,\" \")","v":" "},306]
[{"$nulls":18},305,61,{"$f":"LARGE('JSM Eingabe+TW'!$DJ$32:$DU$62,S78)","v":1e-06},0,0,{"v":1.830000000000012E-4,"d":"0"},0.000305000000000002,null,{"$f":"IF(U78>'JSM Eingabe+TW'!$CU$92,'JSM Eingabe+TW'!$CU$92,\" \")","v":" "},305]
[{"$nulls":18},304,62,{"$f":"LARGE('JSM Eingabe+TW'!$DJ$32:$DU$62,S79)","v":1e-06},0,0,{"v":1.830000000000012E-4,"d":"0"},3.0400000000000197E-4,{"$f":"P$34","v":0},{"$f":"IF(U79>'JSM Eingabe+TW'!$CU$92,'JSM Eingabe+TW'!$CU$92,\" \")","v":" "},304]
[{"$nulls":18},303,63,{"$f":"LARGE('JSM Eingabe+TW'!$DJ$32:$DU$62,S80)","v":1e-06},0,0,{"v":1.830000000000012E-4,"d":"0"},3.03000000000002E-4,null,{"$f":"IF(U80>'JSM Eingabe+TW'!$CU$92,'JSM Eingabe+TW'!$CU$92,\" \")","v":" "},303]
[{"$nulls":18},302,64,{"$f":"LARGE('JSM Eingabe+TW'!$DJ$32:$DU$62,S81)","v":1e-06},0,0,{"v":1.830000000000012E-4,"d":"0"},0.000302000000000002,null,{"$f":"IF(U81>'JSM Eingabe+TW'!$CU$92,'JSM Eingabe+TW'!$CU$92,\" \")","v":" "},302]
[{"$nulls":18},301,65,{"$f":"LARGE('JSM Eingabe+TW'!$DJ$32:$DU$62,S82)","v":1e-06},{"$f":"IF(T82=V$13,LARGE(U$18:U$382,1),0)","v":0},{"$f":"IF(T82=W$13,LARGE(U$18:U$382,1),0)","v":0},{"$f":"P$35","v":{"v":1.830000000000012E-4,"d":"0"}},{"$f":"IF(T82<=$W$13,U82,((U$15-P$34)/(365-W$13)*AB82)+P$34)","v":3.0100000000000195E-4},null,{"$f":"IF(U82>'JSM Eingabe+TW'!$CU$92,'JSM Eingabe+TW'!$CU$92,\" \")","v":" "},301]
[{"$nulls":18},300,66,{"$f":"LARGE('JSM Eingabe+TW'!$DJ$32:$DU$62,S83)","v":1e-06},0,0,{"v":1.830000000000012E-4,"d":"0"},0.000300000000000002,null,{"$f":"IF(U83>'JSM Eingabe+TW'!$CU$92,'JSM Eingabe+TW'!$CU$92,\" \")","v":" "},{"$f":"IF(T83<=W$13,0,S83)","v":300}]
[{"$nulls":18},299,67,{"$f":"LARGE('JSM Eingabe+TW'!$DJ$32:$DU$62,S84)","v":1e-06},0,0,{"v":1.830000000000012E-4,"d":"0"},2.9900000000000196E-4,{"$f":"P$34","v":0},{"$f":"IF(U84>'JSM Eingabe+TW'!$CU$92,'JSM Eingabe+TW'!$CU$92,\" \")","v":" "},299]
[{"$nulls":18},298,68,{"$f":"LARGE('JSM Eingabe+TW'!$DJ$32:$DU$62,S85)","v":1e-06},0,0,{"v":1.830000000000012E-4,"d":"0"},2.9800000000000193E-4,null,{"$f":"IF(U85>'JSM Eingabe+TW'!$CU$92,'JSM Eingabe+TW'!$CU$92,\" \")","v":" "},298]
[{"$nulls":18},297,69,{"$f":"LARGE('JSM Eingabe+TW'!$DJ$32:$DU$62,S86)","v":1e-06},0,0,{"v":1.830000000000012E-4,"d":"0"},2.9700000000000196E-4,null,{"$f":"IF(U86>'JSM Eingabe+TW'!$CU$92,'JSM Eingabe+TW'!$CU$92,\" \")","v":" "},297]
[{"$nulls":18},296,70,{"$f":"LARGE('JSM Eingabe+TW'!$DJ$32:$DU$62,S87)","v":1e-06},0,0,{"v":1.830000000000012E-4,"d":"0"},2.9600000000000194E-4,null,{"$f":"IF(U87>'JSM Eingabe+TW'!$CU$92,'JSM Eingabe+TW'!$CU$92,\" \")","v":" "},296]
[{"$nulls":18},295,71,{"$f":"LARGE('JSM Eingabe+TW'!$DJ$32:$DU$62,S88)","v":1e-06},0,0,{"v":1.830000000000012E-4,"d":"0"},2.9500000000000191E-4,null,{"$f":"IF(U88>'JSM Eingabe+TW'!$CU$92,'JSM Eingabe+TW'!$CU$92,\" \")","v":" "},295]
[{"$nulls":18},294,72,{"$f":"LARGE('JSM Eingabe+TW'!$DJ$32:$DU$62,S89)","v":1e-06},0,0,{"v":1.830000000000012E-4,"d":"0"},2.9400000000000194E-4,{"$f":"P$34","v":0},{"$f":"IF(U89>'JSM Eingabe+TW'!$CU$92,'JSM Eingabe+TW'!$CU$92,\" \")","v":" "},294]
[{"$nulls":18},293,73,{"$f":"LARGE('JSM Eingabe+TW'!$DJ$32:$DU$62,S90)","v":1e-06},0,0,{"v":1.830000000000012E-4,"d":"0"},2.9300000000000192E-4,null,{"$f":"IF(U90>'JSM Eingabe+TW'!$CU$92,'JSM Eingabe+TW'!$CU$92,\" \")","v":" "},293]
[{"$nulls":18},292,74,{"$f":"LARGE('JSM Eingabe+TW'!$DJ$32:$DU$62,S91)","v":1e-06},0,0,{"v":1.830000000000012E-4,"d":"0"},2.9200000000000189E-4,null,{"$f":"IF(U91>'JSM Eingabe+TW'!$CU$92,'JSM Eingabe+TW'!$CU$92,\" \")","v":" "},292]
[{"$nulls":18},291,75,{"$f":"LARGE('JSM Eingabe+TW'!$DJ$32:$DU$62,S92)","v":1e-06},0,0,{"v":1.830000000000012E-4,"d":"0"},2.9100000000000192E-4,null,{"$f":"IF(U92>'JSM Eingabe+TW'!$CU$92,'JSM Eingabe+TW'!$CU$92,\" \")","v":" "},291]
[{"$nulls":18},290,76,{"$f":"LARGE('JSM Eingabe+TW'!$DJ$32:$DU$62,S93)","v":1e-06},0,0,{"v":1.830000000000012E-4,"d":"0"},2.900000000000019E-4,null,{"$f":"IF(U93>'JSM Eingabe+TW'!$CU$92,'JSM Eingabe+TW'!$CU$92,\" \")","v":" "},290]
[{"$nulls":18},289,77,{"$f":"LARGE('JSM Eingabe+TW'!$DJ$32:$DU$62,S94)","v":1e-06},0,0,{"v":1.830000000000012E-4,"d":"0"},2.8900000000000187E-4,{"$f":"P$34","v":0},{"$f":"IF(U94>'JSM Eingabe+TW'!$CU$92,'JSM Eingabe+TW'!$CU$92,\" \")","v":" "},289]
[{"$nulls":18},288,78,{"$f":"LARGE('JSM Eingabe+TW'!$DJ$32:$DU$62,S95)","v":1e-06},0,0,{"v":1.830000000000012E-4,"d":"0"},2.880000000000019E-4,null,{"$f":"IF(U95>'JSM Eingabe+TW'!$CU$92,'JSM Eingabe+TW'!$CU$92,\" \")","v":" "},288]
[{"$nulls":18},287,79,{"$f":"LARGE('JSM Eingabe+TW'!$DJ$32:$DU$62,S96)","v":1e-06},0,0,{"v":1.830000000000012E-4,"d":"0"},2.8700000000000188E-4,null,{"$f":"IF(U96>'JSM Eingabe+TW'!$CU$92,'JSM Eingabe+TW'!$CU$92,\" \")","v":" "},287]
[{"$nulls":18},286,80,{"$f":"LARGE('JSM Eingabe+TW'!$DJ$32:$DU$62,S97)","v":1e-06},0,0,{"v":1.830000000000012E-4,"d":"0"},2.8600000000000186E-4,null,{"$f":"IF(U97>'JSM Eingabe+TW'!$CU$92,'JSM Eingabe+TW'!$CU$92,\" \")","v":" "},286]
[{"$nulls":18},285,81,{"$f":"LARGE('JSM Eingabe+TW'!$DJ$32:$DU$62,S98)","v":1e-06},0,0,{"v":1.830000000000012E-4,"d":"0"},2.8500000000000183E-4,null,{"$f":"IF(U98>'JSM Eingabe+TW'!$CU$92,'JSM Eingabe+TW'!$CU$92,\" \")","v":" "},285]
[{"$nulls":18},284,82,{"$f":"LARGE('JSM Eingabe+TW'!$DJ$32:$DU$62,S99)","v":1e-06},0,0,{"v":1.830000000000012E-4,"d":"0"},2.8400000000000186E-4,{"$f":"P$34","v":0},{"$f":"IF(U99>'JSM Eingabe+TW'!$CU$92,'JSM Eingabe+TW'!$CU$92,\" \")","v":" "},284]
[{"$nulls":18},283,83,{"$f":"LARGE('JSM Eingabe+TW'!$DJ$32:$DU$62,S100)","v":1e-06},0,0,{"v":1.830000000000012E-4,"d":"0"},2.8300000000000184E-4,null,{"$f":"IF(U100>'JSM Eingabe+TW'!$CU$92,'JSM Eingabe+TW'!$CU$92,\" \")","v":" "},283]
[{"$nulls":18},282,84,{"$f":"LARGE('JSM Eingabe+TW'!$DJ$32:$DU$62,S101)","v":1e-06},0,0,{"v":1.830000000000012E-4,"d":"0"},2.8200000000000181E-4,null,{"$f":"IF(U101>'JSM Eingabe+TW'!$CU$92,'JSM Eingabe+TW'!$CU$92,\" \")","v":" "},282]
[{"$nulls":18},281,85,{"$f":"LARGE('JSM Eingabe+TW'!$DJ$32:$DU$62,S102)","v":1e-06},0,0,{"v":1.830000000000012E-4,"d":"0"},2.8100000000000184E-4,null,{"$f":"IF(U102>'JSM Eingabe+TW'!$CU$92,'JSM Eingabe+TW'!$CU$92,\" \")","v":" "},281]
[{"$nulls":18},280,86,{"$f":"LARGE('JSM Eingabe+TW'!$DJ$32:$DU$62,S103)","v":1e-06},0,0,{"v":1.830000000000012E-4,"d":"0"},2.8000000000000182E-4,null,{"$f":"IF(U103>'JSM Eingabe+TW'!$CU$92,'JSM Eingabe+TW'!$CU$92,\" \")","v":" "},280]
[{"$nulls":18},279,87,{"$f":"LARGE('JSM Eingabe+TW'!$DJ$32:$DU$62,S104)","v":1e-06},0,0,{"v":1.830000000000012E-4,"d":"0"},2.7900000000000179E-4,{"$f":"P$34","v":0},{"$f":"IF(U104>'JSM Eingabe+TW'!$CU$92,'JSM Eingabe+TW'!$CU$92,\" \")","v":" "},279]
[{"$nulls":18},278,88,{"$f":"LARGE('JSM Eingabe+TW'!$DJ$32:$DU$62,S105)","v":1e-06},0,0,{"v":1.830000000000012E-4,"d":"0"},2.7800000000000182E-4,null,{"$f":"IF(U105>'JSM Eingabe+TW'!$CU$92,'JSM Eingabe+TW'!$CU$92,\" \")","v":" "},278]
[{"$nulls":18},277,89,{"$f":"LARGE('JSM Eingabe+TW'!$DJ$32:$DU$62,S106)","v":1e-06},0,0,{"v":1.830000000000012E-4,"d":"0"},2.770000000000018E-4,null,{"$f":"IF(U106>'JSM Eingabe+TW'!$CU$92,'JSM Eingabe+TW'!$CU$92,\" \")","v":" "},277]
[{"$nulls":18},276,90,{"$f":"LARGE('JSM Eingabe+TW'!$DJ$32:$DU$62,S107)","v":1e-06},0,0,{"v":1.830000000000012E-4,"d":"0"},2.7600000000000178E-4,null,{"$f":"IF(U107>'JSM Eingabe+TW'!$CU$92,'JSM Eingabe+TW'!$CU$92,\" \")","v":" "},276]
[{"$nulls":18},275,91,{"$f":"LARGE('JSM Eingabe+TW'!$DJ$32:$DU$62,S108)","v":1e-06},0,0,{"v":1.830000000000012E-4,"d":"0"},2.7500000000000181E-4,null,{"$f":"IF(U108>'JSM Eingabe+TW'!$CU$92,'JSM Eingabe+TW'!$CU$92,\" \")","v":" "},275]
[{"$nulls":18},274,92,{"$f":"LARGE('JSM Eingabe+TW'!$DJ$32:$DU$62,S109)","v":1e-06},0,0,{"v":1.830000000000012E-4,"d":"0"},2.7400000000000178E-4,{"$f":"P$34","v":0},{"$f":"IF(U109>'JSM Eingabe+TW'!$CU$92,'JSM Eingabe+TW'!$CU$92,\" \")","v":" "},274]
[{"$nulls":18},273,93,{"$f":"LARGE('JSM Eingabe+TW'!$DJ$32:$DU$62,S110)","v":1e-06},0,0,{"v":1.830000000000012E-4,"d":"0"},2.7300000000000176E-4,null,{"$f":"IF(U110>'JSM Eingabe+TW'!$CU$92,'JSM Eingabe+TW'!$CU$92,\" \")","v":" "},273]
[{"$nulls":18},272,94,{"$f":"LARGE('JSM Eingabe+TW'!$DJ$32:$DU$62,S111)","v":1e-06},0,0,{"v":1.830000000000012E-4,"d":"0"},2.7200000000000179E-4,null,{"$f":"IF(U111>'JSM Eingabe+TW'!$CU$92,'JSM Eingabe+TW'!$CU$92,\" \")","v":" "},272]
[{"$nulls":18},271,95,{"$f":"LARGE('JSM Eingabe+TW'!$DJ$32:$DU$62,S112)","v":1e-06},0,0,{"v":1.830000000000012E-4,"d":"0"},2.7100000000000176E-4,null,{"$f":"IF(U112>'JSM Eingabe+TW'!$CU$92,'JSM Eingabe+TW'!$CU$92,\" \")","v":" "},271]
[{"$nulls":18},270,96,{"$f":"LARGE('JSM Eingabe+TW'!$DJ$32:$DU$62,S113)","v":1e-06},0,0,{"v":1.830000000000012E-4,"d":"0"},2.7000000000000174E-4,null,{"$f":"IF(U113>'JSM Eingabe+TW'!$CU$92,'JSM Eingabe+TW'!$CU$92,\" \")","v":" "},270]
[{"$nulls":18},269,97,{"$f":"LARGE('JSM Eingabe+TW'!$DJ$32:$DU$62,S114)","v":1e-06},0,0,{"v":1.830000000000012E-4,"d":"0"},2.6900000000000177E-4,{"$f":"P$34","v":0},{"$f":"IF(U114>'JSM Eingabe+TW'!$CU$92,'JSM Eingabe+TW'!$CU$92,\" \")","v":" "},269]
[{"$nulls":18},268,98,{"$f":"LARGE('JSM Eingabe+TW'!$DJ$32:$DU$62,S115)","v":1e-06},0,0,{"v":1.830000000000012E-4,"d":"0"},2.6800000000000174E-4,null,{"$f":"IF(U115>'JSM Eingabe+TW'!$CU$92,'JSM Eingabe+TW'!$CU$92,\" \")","v":" "},268]
[{"$nulls":18},267,99,{"$f":"LARGE('JSM Eingabe+TW'!$DJ$32:$DU$62,S116)","v":1e-06},0,0,{"v":1.830000000000012E-4,"d":"0"},2.6700000000000172E-4,null,{"$f":"IF(U116>'JSM Eingabe+TW'!$CU$92,'JSM Eingabe+TW'!$CU$92,\" \")","v":" "},267]
[{"$nulls":18},266,100,{"$f":"LARGE('JSM Eingabe+TW'!$DJ$32:$DU$62,S117)","v":1e-06},0,0,{"v":1.830000000000012E-4,"d":"0"},2.6600000000000175E-4,null,{"$f":"IF(U117>'JSM Eingabe+TW'!$CU$92,'JSM Eingabe+TW'!$CU$92,\" \")","v":" "},266]
[{"$nulls":18},265,101,{"$f":"LARGE('JSM Eingabe+TW'!$DJ$32:$DU$62,S118)","v":1e-06},0,0,{"v":1.830000000000012E-4,"d":"0"},2.6500000000000173E-4,null,{"$f":"IF(U118>'JSM Eingabe+TW'!$CU$92,'JSM Eingabe+TW'!$CU$92,\" \")","v":" "},265]
[{"$nulls":18},264,102,{"$f":"LARGE('JSM Eingabe+TW'!$DJ$32:$DU$62,S119)","v":1e-06},0,0,{"v":1.830000000000012E-4,"d":"0"},2.640000000000017E-4,{"$f":"P$34","v":0},{"$f":"IF(U119>'JSM Eingabe+TW'!$CU$92,'JSM Eingabe+TW'!$CU$92,\" \")","v":" "},264]
[{"$nulls":18},263,103,{"$f":"LARGE('JSM Eingabe+TW'!$DJ$32:$DU$62,S120)","v":1e-06},0,0,{"v":1.830000000000012E-4,"d":"0"},2.6300000000000173E-4,null,{"$f":"IF(U120>'JSM Eingabe+TW'!$CU$92,'JSM Eingabe+TW'!$CU$92,\" \")","v":" "},263]
[{"$nulls":18},262,104,{"$f":"LARGE('JSM Eingabe+TW'!$DJ$32:$DU$62,S121)","v":1e-06},0,0,{"v":1.830000000000012E-4,"d":"0"},2.6200000000000171E-4,null,{"$f":"IF(U121>'JSM Eingabe+TW'!$CU$92,'JSM Eingabe+TW'!$CU$92,\" \")","v":" "},262]
[{"$nulls":18},261,105,{"$f":"LARGE('JSM Eingabe+TW'!$DJ$32:$DU$62,S122)","v":1e-06},0,0,{"v":1.830000000000012E-4,"d":"0"},2.6100000000000168E-4,null,{"$f":"IF(U122>'JSM Eingabe+TW'!$CU$92,'JSM Eingabe+TW'!$CU$92,\" \")","v":" "},261]
[{"$nulls":18},260,106,{"$f":"LARGE('JSM Eingabe+TW'!$DJ$32:$DU$62,S123)","v":1e-06},0,0,{"v":1.830000000000012E-4,"d":"0"},2.6000000000000171E-4,null,{"$f":"IF(U123>'JSM Eingabe+TW'!$CU$92,'JSM Eingabe+TW'!$CU$92,\" \")","v":" "},260]
[{"$nulls":18},259,107,{"$f":"LARGE('JSM Eingabe+TW'!$DJ$32:$DU$62,S124)","v":1e-06},0,0,{"v":1.830000000000012E-4,"d":"0"},2.5900000000000169E-4,{"$f":"P$34","v":0},{"$f":"IF(U124>'JSM Eingabe+TW'!$CU$92,'JSM Eingabe+TW'!$CU$92,\" \")","v":" "},259]
[{"$nulls":18},258,108,{"$f":"LARGE('JSM Eingabe+TW'!$DJ$32:$DU$62,S125)","v":1e-06},0,0,{"v":1.830000000000012E-4,"d":"0"},2.5800000000000166E-4,null,{"$f":"IF(U125>'JSM Eingabe+TW'!$CU$92,'JSM Eingabe+TW'!$CU$92,\" \")","v":" "},258]
[{"$nulls":18},257,109,{"$f":"LARGE('JSM Eingabe+TW'!$DJ$32:$DU$62,S126)","v":1e-06},0,0,{"v":1.830000000000012E-4,"d":"0"},2.5700000000000169E-4,null,{"$f":"IF(U126>'JSM Eingabe+TW'!$CU$92,'JSM Eingabe+TW'!$CU$92,\" \")","v":" "},257]
[{"$nulls":18},256,110,{"$f":"LARGE('JSM Eingabe+TW'!$DJ$32:$DU$62,S127)","v":1e-06},0,0,{"v":1.830000000000012E-4,"d":"0"},2.5600000000000167E-4,null,{"$f":"IF(U127>'JSM Eingabe+TW'!$CU$92,'JSM Eingabe+TW'!$CU$92,\" \")","v":" "},256]
[{"$nulls":18},255,111,{"$f":"LARGE('JSM Eingabe+TW'!$DJ$32:$DU$62,S128)","v":1e-06},0,0,{"v":1.830000000000012E-4,"d":"0"},2.5500000000000164E-4,null,{"$f":"IF(U128>'JSM Eingabe+TW'!$CU$92,'JSM Eingabe+TW'!$CU$92,\" \")","v":" "},255]
[{"$nulls":18},254,112,{"$f":"LARGE('JSM Eingabe+TW'!$DJ$32:$DU$62,S129)","v":1e-06},0,0,{"v":1.830000000000012E-4,"d":"0"},2.5400000000000167E-4,{"$f":"P$34","v":0},{"$f":"IF(U129>'JSM Eingabe+TW'!$CU$92,'JSM Eingabe+TW'!$CU$92,\" \")","v":" "},254]
[{"$nulls":18},253,113,{"$f":"LARGE('JSM Eingabe+TW'!$DJ$32:$DU$62,S130)","v":1e-06},0,0,{"v":1.830000000000012E-4,"d":"0"},2.5300000000000165E-4,null,{"$f":"IF(U130>'JSM Eingabe+TW'!$CU$92,'JSM Eingabe+TW'!$CU$92,\" \")","v":" "},253]
[{"$nulls":18},252,114,{"$f":"LARGE('JSM Eingabe+TW'!$DJ$32:$DU$62,S131)","v":1e-06},0,0,{"v":1.830000000000012E-4,"d":"0"},2.5200000000000163E-4,null,{"$f":"IF(U131>'JSM Eingabe+TW'!$CU$92,'JSM Eingabe+TW'!$CU$92,\" \")","v":" "},252]
[{"$nulls":18},251,115,{"$f":"LARGE('JSM Eingabe+TW'!$DJ$32:$DU$62,S132)","v":1e-06},0,0,{"v":1.830000000000012E-4,"d":"0"},2.5100000000000166E-4,null,{"$f":"IF(U132>'JSM Eingabe+TW'!$CU$92,'JSM Eingabe+TW'!$CU$92,\" \")","v":" "},251]
[{"$nulls":18},250,116,{"$f":"LARGE('JSM Eingabe+TW'!$DJ$32:$DU$62,S133)","v":1e-06},0,0,{"v":1.830000000000012E-4,"d":"0"},2.5000000000000163E-4,null,{"$f":"IF(U133>'JSM Eingabe+TW'!$CU$92,'JSM Eingabe+TW'!$CU$92,\" \")","v":" "},250]
[{"$nulls":18},249,117,{"$f":"LARGE('JSM Eingabe+TW'!$DJ$32:$DU$62,S134)","v":1e-06},0,0,{"v":1.830000000000012E-4,"d":"0"},2.4900000000000161E-4,{"$f":"P$34","v":0},{"$f":"IF(U134>'JSM Eingabe+TW'!$CU$92,'JSM Eingabe+TW'!$CU$92,\" \")","v":" "},249]
[{"$nulls":18},248,118,{"$f":"LARGE('JSM Eingabe+TW'!$DJ$32:$DU$62,S135)","v":1e-06},0,0,{"v":1.830000000000012E-4,"d":"0"},2.4800000000000164E-4,null,{"$f":"IF(U135>'JSM Eingabe+TW'!$CU$92,'JSM Eingabe+TW'!$CU$92,\" \")","v":" "},248]
[{"$nulls":18},247,119,{"$f":"LARGE('JSM Eingabe+TW'!$DJ$32:$DU$62,S136)","v":1e-06},0,0,{"v":1.830000000000012E-4,"d":"0"},2.4700000000000161E-4,null,{"$f":"IF(U136>'JSM Eingabe+TW'!$CU$92,'JSM Eingabe+TW'!$CU$92,\" \")","v":" "},247]
[{"$nulls":18},246,120,{"$f":"LARGE('JSM Eingabe+TW'!$DJ$32:$DU$62,S137)","v":1e-06},0,0,{"v":1.830000000000012E-4,"d":"0"},2.4600000000000159E-4,null,{"$f":"IF(U137>'JSM Eingabe+TW'!$CU$92,'JSM Eingabe+TW'!$CU$92,\" \")","v":" "},246]
[{"$nulls":18},245,121,{"$f":"LARGE('JSM Eingabe+TW'!$DJ$32:$DU$62,S138)","v":1e-06},0,0,{"v":1.830000000000012E-4,"d":"0"},2.4500000000000162E-4,null,{"$f":"IF(U138>'JSM Eingabe+TW'!$CU$92,'JSM Eingabe+TW'!$CU$92,\" \")","v":" "},245]
[{"$nulls":18},244,122,{"$f":"LARGE('JSM Eingabe+TW'!$DJ$32:$DU$62,S139)","v":1e-06},0,0,{"v":1.830000000000012E-4,"d":"0"},2.4400000000000159E-4,{"$f":"P$34","v":0},{"$f":"IF(U139>'JSM Eingabe+TW'!$CU$92,'JSM Eingabe+TW'!$CU$92,\" \")","v":" "},244]
[{"$nulls":18},243,123,{"$f":"LARGE('JSM Eingabe+TW'!$DJ$32:$DU$62,S140)","v":1e-06},0,0,{"v":1.830000000000012E-4,"d":"0"},2.430000000000016E-4,null,{"$f":"IF(U140>'JSM Eingabe+TW'!$CU$92,'JSM Eingabe+TW'!$CU$92,\" \")","v":" "},243]
[{"$nulls":18},242,124,{"$f":"LARGE('JSM Eingabe+TW'!$DJ$32:$DU$62,S141)","v":1e-06},0,0,{"v":1.830000000000012E-4,"d":"0"},2.4200000000000157E-4,null,{"$f":"IF(U141>'JSM Eingabe+TW'!$CU$92,'JSM Eingabe+TW'!$CU$92,\" \")","v":" "},242]
[{"$nulls":18},241,125,{"$f":"LARGE('JSM Eingabe+TW'!$DJ$32:$DU$62,S142)","v":1e-06},0,0,{"v":1.830000000000012E-4,"d":"0"},2.4100000000000158E-4,null,{"$f":"IF(U142>'JSM Eingabe+TW'!$CU$92,'JSM Eingabe+TW'!$CU$92,\" \")","v":" "},241]
[{"$nulls":18},240,126,{"$f":"LARGE('JSM Eingabe+TW'!$DJ$32:$DU$62,S143)","v":1e-06},0,0,{"v":1.830000000000012E-4,"d":"0"},2.4000000000000155E-4,null,{"$f":"IF(U143>'JSM Eingabe+TW'!$CU$92,'JSM Eingabe+TW'!$CU$92,\" \")","v":" "},240]
[{"$nulls":18},239,127,{"$f":"LARGE('JSM Eingabe+TW'!$DJ$32:$DU$62,S144)","v":1e-06},0,0,{"v":1.830000000000012E-4,"d":"0"},2.3900000000000155E-4,{"$f":"P$34","v":0},{"$f":"IF(U144>'JSM Eingabe+TW'!$CU$92,'JSM Eingabe+TW'!$CU$92,\" \")","v":" "},239]
[{"$nulls":18},238,128,{"$f":"LARGE('JSM Eingabe+TW'!$DJ$32:$DU$62,S145)","v":1e-06},0,0,{"v":1.830000000000012E-4,"d":"0"},2.3800000000000156E-4,null,{"$f":"IF(U145>'JSM Eingabe+TW'!$CU$92,'JSM Eingabe+TW'!$CU$92,\" \")","v":" "},238]
[{"$nulls":18},237,129,{"$f":"LARGE('JSM Eingabe+TW'!$DJ$32:$DU$62,S146)","v":1e-06},{"$f":"IF(T146=V$13,LARGE(U$18:U$382,1),0)","v":0},{"$f":"IF(T146=W$13,LARGE(U$18:U$382,1),0)","v":0},{"$f":"P$35","v":{"v":1.830000000000012E-4,"d":"0"}},{"$f":"IF(T146<=$W$13,U146,((U$15-P$34)/(365-W$13)*AB146)+P$34)","v":2.3700000000000153E-4},null,{"$f":"IF(U146>'JSM Eingabe+TW'!$CU$92,'JSM Eingabe+TW'!$CU$92,\" \")","v":" "},237]
[{"$nulls":18},236,130,{"$f":"LARGE('JSM Eingabe+TW'!$DJ$32:$DU$62,S147)","v":1e-06},0,0,{"v":1.830000000000012E-4,"d":"0"},2.3600000000000154E-4,null,{"$f":"IF(U147>'JSM Eingabe+TW'!$CU$92,'JSM Eingabe+TW'!$CU$92,\" \")","v":" "},{"$f":"IF(T147<=W$13,0,S147)","v":236}]
[{"$nulls":18},235,131,{"$f":"LARGE('JSM Eingabe+TW'!$DJ$32:$DU$62,S148)","v":1e-06},0,0,{"v":1.830000000000012E-4,"d":"0"},2.3500000000000154E-4,null,{"$f":"IF(U148>'JSM Eingabe+TW'!$CU$92,'JSM Eingabe+TW'!$CU$92,\" \")","v":" "},235]
[{"$nulls":18},234,132,{"$f":"LARGE('JSM Eingabe+TW'!$DJ$32:$DU$62,S149)","v":1e-06},0,0,{"v":1.830000000000012E-4,"d":"0"},2.3400000000000151E-4,{"$f":"P$34","v":0},{"$f":"IF(U149>'JSM Eingabe+TW'!$CU$92,'JSM Eingabe+TW'!$CU$92,\" \")","v":" "},234]
[{"$nulls":18},233,133,{"$f":"LARGE('JSM Eingabe+TW'!$DJ$32:$DU$62,S150)","v":1e-06},0,0,{"v":1.830000000000012E-4,"d":"0"},2.3300000000000152E-4,null,{"$f":"IF(U150>'JSM Eingabe+TW'!$CU$92,'JSM Eingabe+TW'!$CU$92,\" \")","v":" "},233]
[{"$nulls":18},232,134,{"$f":"LARGE('JSM Eingabe+TW'!$DJ$32:$DU$62,S151)","v":1e-06},0,0,{"v":1.830000000000012E-4,"d":"0"},2.3200000000000152E-4,null,{"$f":"IF(U151>'JSM Eingabe+TW'!$CU$92,'JSM Eingabe+TW'!$CU$92,\" \")","v":" "},232]
[{"$nulls":18},231,135,{"$f":"LARGE('JSM Eingabe+TW'!$DJ$32:$DU$62,S152)","v":1e-06},0,0,{"v":1.830000000000012E-4,"d":"0"},2.3100000000000149E-4,null,{"$f":"IF(U152>'JSM Eingabe+TW'!$CU$92,'JSM Eingabe+TW'!$CU$92,\" \")","v":" "},231]
[{"$nulls":18},230,136,{"$f":"LARGE('JSM Eingabe+TW'!$DJ$32:$DU$62,S153)","v":1e-06},0,0,{"v":1.830000000000012E-4,"d":"0"},2.300000000000015E-4,null,{"$f":"IF(U153>'JSM Eingabe+TW'!$CU$92,'JSM Eingabe+TW'!$CU$92,\" \")","v":" "},230]
[{"$nulls":18},229,137,{"$f":"LARGE('JSM Eingabe+TW'!$DJ$32:$DU$62,S154)","v":1e-06},0,0,{"v":1.830000000000012E-4,"d":"0"},2.290000000000015E-4,{"$f":"P$34","v":0},{"$f":"IF(U154>'JSM Eingabe+TW'!$CU$92,'JSM Eingabe+TW'!$CU$92,\" \")","v":" "},229]
[{"$nulls":18},228,138,{"$f":"LARGE('JSM Eingabe+TW'!$DJ$32:$DU$62,S155)","v":1e-06},0,0,{"v":1.830000000000012E-4,"d":"0"},2.2800000000000148E-4,null,{"$f":"IF(U155>'JSM Eingabe+TW'!$CU$92,'JSM Eingabe+TW'!$CU$92,\" \")","v":" "},228]
[{"$nulls":18},227,139,{"$f":"LARGE('JSM Eingabe+TW'!$DJ$32:$DU$62,S156)","v":1e-06},0,0,{"v":1.830000000000012E-4,"d":"0"},2.2700000000000148E-4,null,{"$f":"IF(U156>'JSM Eingabe+TW'!$CU$92,'JSM Eingabe+TW'!$CU$92,\" \")","v":" "},227]
[{"$nulls":18},226,140,{"$f":"LARGE('JSM Eingabe+TW'!$DJ$32:$DU$62,S157)","v":1e-06},0,0,{"v":1.830000000000012E-4,"d":"0"},2.2600000000000148E-4,null,{"$f":"IF(U157>'JSM Eingabe+TW'!$CU$92,'JSM Eingabe+TW'!$CU$92,\" \")","v":" "},226]
[{"$nulls":18},225,141,{"$f":"LARGE('JSM Eingabe+TW'!$DJ$32:$DU$62,S158)","v":1e-06},0,0,{"v":1.830000000000012E-4,"d":"0"},2.2500000000000146E-4,null,{"$f":"IF(U158>'JSM Eingabe+TW'!$CU$92,'JSM Eingabe+TW'!$CU$92,\" \")","v":" "},225]
[{"$nulls":18},224,142,{"$f":"LARGE('JSM Eingabe+TW'!$DJ$32:$DU$62,S159)","v":1e-06},0,0,{"v":1.830000000000012E-4,"d":"0"},2.2400000000000146E-4,{"$f":"P$34","v":0},{"$f":"IF(U159>'JSM Eingabe+TW'!$CU$92,'JSM Eingabe+TW'!$CU$92,\" \")","v":" "},224]
[{"$nulls":18},223,143,{"$f":"LARGE('JSM Eingabe+TW'!$DJ$32:$DU$62,S160)","v":1e-06},0,0,{"v":1.830000000000012E-4,"d":"0"},2.2300000000000146E-4,null,{"$f":"IF(U160>'JSM Eingabe+TW'!$CU$92,'JSM Eingabe+TW'!$CU$92,\" \")","v":" "},223]
[{"$nulls":18},222,144,{"$f":"LARGE('JSM Eingabe+TW'!$DJ$32:$DU$62,S161)","v":1e-06},0,0,{"v":1.830000000000012E-4,"d":"0"},2.2200000000000144E-4,null,{"$f":"IF(U161>'JSM Eingabe+TW'!$CU$92,'JSM Eingabe+TW'!$CU$92,\" \")","v":" "},222]
[{"$nulls":18},221,145,{"$f":"LARGE('JSM Eingabe+TW'!$DJ$32:$DU$62,S162)","v":1e-06},0,0,{"v":1.830000000000012E-4,"d":"0"},2.2100000000000144E-4,null,{"$f":"IF(U162>'JSM Eingabe+TW'!$CU$92,'JSM Eingabe+TW'!$CU$92,\" \")","v":" "},221]
[{"$nulls":18},220,146,{"$f":"LARGE('JSM Eingabe+TW'!$DJ$32:$DU$62,S163)","v":1e-06},0,0,{"v":1.830000000000012E-4,"d":"0"},2.2000000000000144E-4,null,{"$f":"IF(U163>'JSM Eingabe+TW'!$CU$92,'JSM Eingabe+TW'!$CU$92,\" \")","v":" "},220]
[{"$nulls":18},219,147,{"$f":"LARGE('JSM Eingabe+TW'!$DJ$32:$DU$62,S164)","v":1e-06},0,0,{"v":1.830000000000012E-4,"d":"0"},2.1900000000000142E-4,{"$f":"P$34","v":0},{"$f":"IF(U164>'JSM Eingabe+TW'!$CU$92,'JSM Eingabe+TW'!$CU$92,\" \")","v":" "},219]
[{"$nulls":18},218,148,{"$f":"LARGE('JSM Eingabe+TW'!$DJ$32:$DU$62,S165)","v":1e-06},0,0,{"v":1.830000000000012E-4,"d":"0"},2.1800000000000142E-4,null,{"$f":"IF(U165>'JSM Eingabe+TW'!$CU$92,'JSM Eingabe+TW'!$CU$92,\" \")","v":" "},218]
[{"$nulls":18},217,149,{"$f":"LARGE('JSM Eingabe+TW'!$DJ$32:$DU$62,S166)","v":1e-06},0,0,{"v":1.830000000000012E-4,"d":"0"},2.1700000000000143E-4,null,{"$f":"IF(U166>'JSM Eingabe+TW'!$CU$92,'JSM Eingabe+TW'!$CU$92,\" \")","v":" "},217]
[{"$nulls":18},216,150,{"$f":"LARGE('JSM Eingabe+TW'!$DJ$32:$DU$62,S167)","v":1e-06},0,0,{"v":1.830000000000012E-4,"d":"0"},2.160000000000014E-4,null,{"$f":"IF(U167>'JSM Eingabe+TW'!$CU$92,'JSM Eingabe+TW'!$CU$92,\" \")","v":" "},216]
[{"$nulls":18},215,151,{"$f":"LARGE('JSM Eingabe+TW'!$DJ$32:$DU$62,S168)","v":1e-06},0,0,{"v":1.830000000000012E-4,"d":"0"},2.150000000000014E-4,null,{"$f":"IF(U168>'JSM Eingabe+TW'!$CU$92,'JSM Eingabe+TW'!$CU$92,\" \")","v":" "},215]
[{"$nulls":18},214,152,{"$f":"LARGE('JSM Eingabe+TW'!$DJ$32:$DU$62,S169)","v":1e-06},0,0,{"v":1.830000000000012E-4,"d":"0"},2.1400000000000141E-4,null,{"$f":"IF(U169>'JSM Eingabe+TW'!$CU$92,'JSM Eingabe+TW'!$CU$92,\" \")","v":" "},214]
[{"$nulls":18},213,153,{"$f":"LARGE('JSM Eingabe+TW'!$DJ$32:$DU$62,S170)","v":1e-06},0,0,{"v":1.830000000000012E-4,"d":"0"},2.1300000000000138E-4,{"$f":"P$34","v":0},{"$f":"IF(U170>'JSM Eingabe+TW'!$CU$92,'JSM Eingabe+TW'!$CU$92,\" \")","v":" "},213]
[{"$nulls":18},212,154,{"$f":"LARGE('JSM Eingabe+TW'!$DJ$32:$DU$62,S171)","v":1e-06},0,0,{"v":1.830000000000012E-4,"d":"0"},2.1200000000000139E-4,null,{"$f":"IF(U171>'JSM Eingabe+TW'!$CU$92,'JSM Eingabe+TW'!$CU$92,\" \")","v":" "},212]
[{"$nulls":18},211,155,{"$f":"LARGE('JSM Eingabe+TW'!$DJ$32:$DU$62,S172)","v":1e-06},0,0,{"v":1.830000000000012E-4,"d":"0"},2.1100000000000139E-4,null,{"$f":"IF(U172>'JSM Eingabe+TW'!$CU$92,'JSM Eingabe+TW'!$CU$92,\" \")","v":" "},211]
[{"$nulls":18},210,156,{"$f":"LARGE('JSM Eingabe+TW'!$DJ$32:$DU$62,S173)","v":1e-06},0,0,{"v":1.830000000000012E-4,"d":"0"},2.1000000000000136E-4,null,{"$f":"IF(U173>'JSM Eingabe+TW'!$CU$92,'JSM Eingabe+TW'!$CU$92,\" \")","v":" "},210]
[{"$nulls":18},209,157,{"$f":"LARGE('JSM Eingabe+TW'!$DJ$32:$DU$62,S174)","v":1e-06},0,0,{"v":1.830000000000012E-4,"d":"0"},2.0900000000000137E-4,null,{"$f":"IF(U174>'JSM Eingabe+TW'!$CU$92,'JSM Eingabe+TW'!$CU$92,\" \")","v":" "},209]
[{"$nulls":18},208,158,{"$f":"LARGE('JSM Eingabe+TW'!$DJ$32:$DU$62,S175)","v":1e-06},0,0,{"v":1.830000000000012E-4,"d":"0"},2.0800000000000137E-4,{"$f":"P$34","v":0},{"$f":"IF(U175>'JSM Eingabe+TW'!$CU$92,'JSM Eingabe+TW'!$CU$92,\" \")","v":" "},208]
[{"$nulls":18},207,159,{"$f":"LARGE('JSM Eingabe+TW'!$DJ$32:$DU$62,S176)","v":1e-06},0,0,{"v":1.830000000000012E-4,"d":"0"},2.0700000000000135E-4,null,{"$f":"IF(U176>'JSM Eingabe+TW'!$CU$92,'JSM Eingabe+TW'!$CU$92,\" \")","v":" "},207]
[{"$nulls":18},206,160,{"$f":"LARGE('JSM Eingabe+TW'!$DJ$32:$DU$62,S177)","v":1e-06},0,0,{"v":1.830000000000012E-4,"d":"0"},2.0600000000000135E-4,null,{"$f":"IF(U177>'JSM Eingabe+TW'!$CU$92,'JSM Eingabe+TW'!$CU$92,\" \")","v":" "},206]
[{"$nulls":18},205,161,{"$f":"LARGE('JSM Eingabe+TW'!$DJ$32:$DU$62,S178)","v":1e-06},0,0,{"v":1.830000000000012E-4,"d":"0"},2.0500000000000132E-4,null,{"$f":"IF(U178>'JSM Eingabe+TW'!$CU$92,'JSM Eingabe+TW'!$CU$92,\" \")","v":" "},205]
[{"$nulls":18},204,162,{"$f":"LARGE('JSM Eingabe+TW'!$DJ$32:$DU$62,S179)","v":1e-06},0,0,{"v":1.830000000000012E-4,"d":"0"},2.0400000000000133E-4,null,{"$f":"IF(U179>'JSM Eingabe+TW'!$CU$92,'JSM Eingabe+TW'!$CU$92,\" \")","v":" "},204]
[{"$nulls":18},203,163,{"$f":"LARGE('JSM Eingabe+TW'!$DJ$32:$DU$62,S180)","v":1e-06},0,0,{"v":1.830000000000012E-4,"d":"0"},2.0300000000000133E-4,{"$f":"P$34","v":0},{"$f":"IF(U180>'JSM Eingabe+TW'!$CU$92,'JSM Eingabe+TW'!$CU$92,\" \")","v":" "},203]
[{"$nulls":18},202,164,{"$f":"LARGE('JSM Eingabe+TW'!$DJ$32:$DU$62,S181)","v":1e-06},0,0,{"v":1.830000000000012E-4,"d":"0"},2.0200000000000131E-4,null,{"$f":"IF(U181>'JSM Eingabe+TW'!$CU$92,'JSM Eingabe+TW'!$CU$92,\" \")","v":" "},202]
[{"$nulls":18},201,165,{"$f":"LARGE('JSM Eingabe+TW'!$DJ$32:$DU$62,S182)","v":1e-06},0,0,{"v":1.830000000000012E-4,"d":"0"},2.0100000000000131E-4,null,{"$f":"IF(U182>'JSM Eingabe+TW'!$CU$92,'JSM Eingabe+TW'!$CU$92,\" \")","v":" "},201]
[{"$nulls":18},200,166,{"$f":"LARGE('JSM Eingabe+TW'!$DJ$32:$DU$62,S183)","v":1e-06},0,0,{"v":1.830000000000012E-4,"d":"0"},2.0000000000000131E-4,null,{"$f":"IF(U183>'JSM Eingabe+TW'!$CU$92,'JSM Eingabe+TW'!$CU$92,\" \")","v":" "},200]
[{"$nulls":18},199,167,{"$f":"LARGE('JSM Eingabe+TW'!$DJ$32:$DU$62,S184)","v":1e-06},0,0,{"v":1.830000000000012E-4,"d":"0"},1.9900000000000129E-4,null,{"$f":"IF(U184>'JSM Eingabe+TW'!$CU$92,'JSM Eingabe+TW'!$CU$92,\" \")","v":" "},199]
[{"$nulls":18},198,168,{"$f":"LARGE('JSM Eingabe+TW'!$DJ$32:$DU$62,S185)","v":1e-06},0,0,{"v":1.830000000000012E-4,"d":"0"},1.9800000000000129E-4,{"$f":"P$34","v":0},{"$f":"IF(U185>'JSM Eingabe+TW'!$CU$92,'JSM Eingabe+TW'!$CU$92,\" \")","v":" "},198]
[{"$nulls":18},197,169,{"$f":"LARGE('JSM Eingabe+TW'!$DJ$32:$DU$62,S186)","v":1e-06},0,0,{"v":1.830000000000012E-4,"d":"0"},1.9700000000000129E-4,null,{"$f":"IF(U186>'JSM Eingabe+TW'!$CU$92,'JSM Eingabe+TW'!$CU$92,\" \")","v":" "},197]
[{"$nulls":18},196,170,{"$f":"LARGE('JSM Eingabe+TW'!$DJ$32:$DU$62,S187)","v":1e-06},0,0,{"v":1.830000000000012E-4,"d":"0"},1.9600000000000127E-4,null,{"$f":"IF(U187>'JSM Eingabe+TW'!$CU$92,'JSM Eingabe+TW'!$CU$92,\" \")","v":" "},196]
[{"$nulls":18},195,171,{"$f":"LARGE('JSM Eingabe+TW'!$DJ$32:$DU$62,S188)","v":1e-06},0,0,{"v":1.830000000000012E-4,"d":"0"},1.9500000000000127E-4,null,{"$f":"IF(U188>'JSM Eingabe+TW'!$CU$92,'JSM Eingabe+TW'!$CU$92,\" \")","v":" "},195]
[{"$nulls":18},194,172,{"$f":"LARGE('JSM Eingabe+TW'!$DJ$32:$DU$62,S189)","v":1e-06},0,0,{"v":1.830000000000012E-4,"d":"0"},1.9400000000000127E-4,null,{"$f":"IF(U189>'JSM Eingabe+TW'!$CU$92,'JSM Eingabe+TW'!$CU$92,\" \")","v":" "},194]
[{"$nulls":18},193,173,{"$f":"LARGE('JSM Eingabe+TW'!$DJ$32:$DU$62,S190)","v":1e-06},0,0,{"v":1.830000000000012E-4,"d":"0"},1.9300000000000125E-4,{"$f":"P$34","v":0},{"$f":"IF(U190>'JSM Eingabe+TW'!$CU$92,'JSM Eingabe+TW'!$CU$92,\" \")","v":" "},193]
[{"$nulls":18},192,174,{"$f":"LARGE('JSM Eingabe+TW'!$DJ$32:$DU$62,S191)","v":1e-06},0,0,{"v":1.830000000000012E-4,"d":"0"},1.9200000000000125E-4,null,{"$f":"IF(U191>'JSM Eingabe+TW'!$CU$92,'JSM Eingabe+TW'!$CU$92,\" \")","v":" "},192]
[{"$nulls":18},191,175,{"$f":"LARGE('JSM Eingabe+TW'!$DJ$32:$DU$62,S192)","v":1e-06},0,0,{"v":1.830000000000012E-4,"d":"0"},1.9100000000000125E-4,null,{"$f":"IF(U192>'JSM Eingabe+TW'!$CU$92,'JSM Eingabe+TW'!$CU$92,\" \")","v":" "},191]
[{"$nulls":18},190,176,{"$f":"LARGE('JSM Eingabe+TW'!$DJ$32:$DU$62,S193)","v":1e-06},0,0,{"v":1.830000000000012E-4,"d":"0"},1.9000000000000123E-4,null,{"$f":"IF(U193>'JSM Eingabe+TW'!$CU$92,'JSM Eingabe+TW'!$CU$92,\" \")","v":" "},190]
[{"$nulls":18},189,177,{"$f":"LARGE('JSM Eingabe+TW'!$DJ$32:$DU$62,S194)","v":1e-06},0,0,{"v":1.830000000000012E-4,"d":"0"},1.8900000000000123E-4,null,{"$f":"IF(U194>'JSM Eingabe+TW'!$CU$92,'JSM Eingabe+TW'!$CU$92,\" \")","v":" "},189]
[{"$nulls":18},188,178,{"$f":"LARGE('JSM Eingabe+TW'!$DJ$32:$DU$62,S195)","v":1e-06},0,0,{"v":1.830000000000012E-4,"d":"0"},1.8800000000000124E-4,{"$f":"P$34","v":0},{"$f":"IF(U195>'JSM Eingabe+TW'!$CU$92,'JSM Eingabe+TW'!$CU$92,\" \")","v":" "},188]
[{"$nulls":18},187,179,{"$f":"LARGE('JSM Eingabe+TW'!$DJ$32:$DU$62,S196)","v":1e-06},0,0,{"v":1.830000000000012E-4,"d":"0"},1.8700000000000121E-4,null,{"$f":"IF(U196>'JSM Eingabe+TW'!$CU$92,'JSM Eingabe+TW'!$CU$92,\" \")","v":" "},187]
[{"$nulls":18},186,180,{"$f":"LARGE('JSM Eingabe+TW'!$DJ$32:$DU$62,S197)","v":1e-06},0,0,{"v":1.830000000000012E-4,"d":"0"},1.8600000000000121E-4,null,{"$f":"IF(U197>'JSM Eingabe+TW'!$CU$92,'JSM Eingabe+TW'!$CU$92,\" \")","v":" "},186]
[{"$nulls":18},185,181,{"$f":"LARGE('JSM Eingabe+TW'!$DJ$32:$DU$62,S198)","v":1e-06},0,0,{"v":1.830000000000012E-4,"d":"0"},1.8500000000000122E-4,null,{"$f":"IF(U198>'JSM Eingabe+TW'!$CU$92,'JSM Eingabe+TW'!$CU$92,\" \")","v":" "},185]
[{"$nulls":18},184,182,{"$f":"LARGE('JSM Eingabe+TW'!$DJ$32:$DU$62,S199)","v":1e-06},0,0,{"v":1.830000000000012E-4,"d":"0"},1.8400000000000119E-4,null,{"$f":"IF(U199>'JSM Eingabe+TW'!$CU$92,'JSM Eingabe+TW'!$CU$92,\" \")","v":" "},184]
[{"$nulls":18},183,183,{"$f":"LARGE('JSM Eingabe+TW'!$DJ$32:$DU$62,S200)","v":1e-06},0,0,{"v":1.830000000000012E-4,"d":"0"},1.830000000000012E-4,{"$f":"P$34","v":0},{"$f":"IF(U200>'JSM Eingabe+TW'!$CU$92,'JSM Eingabe+TW'!$CU$92,\" \")","v":" "},183]
[{"$nulls":18},182,184,{"$f":"LARGE('JSM Eingabe+TW'!$DJ$32:$DU$62,S201)","v":1e-06},0,0,{"v":1.830000000000012E-4,"d":"0"},1.820000000000012E-4,null,{"$f":"IF(U201>'JSM Eingabe+TW'!$CU$92,'JSM Eingabe+TW'!$CU$92,\" \")","v":" "},182]
[{"$nulls":18},181,185,{"$f":"LARGE('JSM Eingabe+TW'!$DJ$32:$DU$62,S202)","v":1e-06},0,0,{"v":1.830000000000012E-4,"d":"0"},1.8100000000000117E-4,null,{"$f":"IF(U202>'JSM Eingabe+TW'!$CU$92,'JSM Eingabe+TW'!$CU$92,\" \")","v":" "},181]
[{"$nulls":18},180,186,{"$f":"LARGE('JSM Eingabe+TW'!$DJ$32:$DU$62,S203)","v":1e-06},0,0,{"v":1.830000000000012E-4,"d":"0"},1.8000000000000118E-4,null,{"$f":"IF(U203>'JSM Eingabe+TW'!$CU$92,'JSM Eingabe+TW'!$CU$92,\" \")","v":" "},180]
[{"$nulls":18},179,187,{"$f":"LARGE('JSM Eingabe+TW'!$DJ$32:$DU$62,S204)","v":1e-06},0,0,{"v":1.830000000000012E-4,"d":"0"},1.7900000000000118E-4,null,{"$f":"IF(U204>'JSM Eingabe+TW'!$CU$92,'JSM Eingabe+TW'!$CU$92,\" \")","v":" "},179]
[{"$nulls":18},178,188,{"$f":"LARGE('JSM Eingabe+TW'!$DJ$32:$DU$62,S205)","v":1e-06},0,0,{"v":1.830000000000012E-4,"d":"0"},1.7800000000000116E-4,{"$f":"P$34","v":0},{"$f":"IF(U205>'JSM Eingabe+TW'!$CU$92,'JSM Eingabe+TW'!$CU$92,\" \")","v":" "},178]
[{"$nulls":18},177,189,{"$f":"LARGE('JSM Eingabe+TW'!$DJ$32:$DU$62,S206)","v":1e-06},0,0,{"v":1.830000000000012E-4,"d":"0"},1.7700000000000116E-4,null,{"$f":"IF(U206>'JSM Eingabe+TW'!$CU$92,'JSM Eingabe+TW'!$CU$92,\" \")","v":" "},177]
[{"$nulls":18},176,190,{"$f":"LARGE('JSM Eingabe+TW'!$DJ$32:$DU$62,S207)","v":1e-06},0,0,{"v":1.830000000000012E-4,"d":"0"},1.7600000000000113E-4,null,{"$f":"IF(U207>'JSM Eingabe+TW'!$CU$92,'JSM Eingabe+TW'!$CU$92,\" \")","v":" "},176]
[{"$nulls":18},175,191,{"$f":"LARGE('JSM Eingabe+TW'!$DJ$32:$DU$62,S208)","v":1e-06},0,0,{"v":1.830000000000012E-4,"d":"0"},1.7500000000000114E-4,null,{"$f":"IF(U208>'JSM Eingabe+TW'!$CU$92,'JSM Eingabe+TW'!$CU$92,\" \")","v":" "},175]
[{"$nulls":18},174,192,{"$f":"LARGE('JSM Eingabe+TW'!$DJ$32:$DU$62,S209)","v":1e-06},0,0,{"v":1.830000000000012E-4,"d":"0"},1.7400000000000114E-4,null,{"$f":"IF(U209>'JSM Eingabe+TW'!$CU$92,'JSM Eingabe+TW'!$CU$92,\" \")","v":" "},174]
[{"$nulls":18},173,193,{"$f":"LARGE('JSM Eingabe+TW'!$DJ$32:$DU$62,S210)","v":1e-06},{"$f":"IF(T210=V$13,LARGE(U$18:U$382,1),0)","v":0},{"$f":"IF(T210=W$13,LARGE(U$18:U$382,1),0)","v":0},{"$f":"P$35","v":{"v":1.830000000000012E-4,"d":"0"}},{"$f":"IF(T210<=$W$13,U210,((U$15-P$34)/(365-W$13)*AB210)+P$34)","v":1.7300000000000112E-4},{"$f":"P$34","v":0},{"$f":"IF(U210>'JSM Eingabe+TW'!$CU$92,'JSM Eingabe+TW'!$CU$92,\" \")","v":" "},173]
[{"$nulls":18},172,194,{"$f":"LARGE('JSM Eingabe+TW'!$DJ$32:$DU$62,S211)","v":1e-06},0,0,{"v":1.830000000000012E-4,"d":"0"},1.7200000000000112E-4,null,{"$f":"IF(U211>'JSM Eingabe+TW'!$CU$92,'JSM Eingabe+TW'!$CU$92,\" \")","v":" "},{"$f":"IF(T211<=W$13,0,S211)","v":172}]
[{"$nulls":18},171,195,{"$f":"LARGE('JSM Eingabe+TW'!$DJ$32:$DU$62,S212)","v":1e-06},0,0,{"v":1.830000000000012E-4,"d":"0"},1.7100000000000112E-4,null,{"$f":"IF(U212>'JSM Eingabe+TW'!$CU$92,'JSM Eingabe+TW'!$CU$92,\" \")","v":" "},171]
[{"$nulls":18},170,196,{"$f":"LARGE('JSM Eingabe+TW'!$DJ$32:$DU$62,S213)","v":1e-06},0,0,{"v":1.830000000000012E-4,"d":"0"},1.700000000000011E-4,null,{"$f":"IF(U213>'JSM Eingabe+TW'!$CU$92,'JSM Eingabe+TW'!$CU$92,\" \")","v":" "},170]
[{"$nulls":18},169,197,{"$f":"LARGE('JSM Eingabe+TW'!$DJ$32:$DU$62,S214)","v":1e-06},0,0,{"v":1.830000000000012E-4,"d":"0"},1.690000000000011E-4,null,{"$f":"IF(U214>'JSM Eingabe+TW'!$CU$92,'JSM Eingabe+TW'!$CU$92,\" \")","v":" "},169]
[{"$nulls":18},168,198,{"$f":"LARGE('JSM Eingabe+TW'!$DJ$32:$DU$62,S215)","v":1e-06},0,0,{"v":1.830000000000012E-4,"d":"0"},1.680000000000011E-4,{"$f":"P$34","v":0},{"$f":"IF(U215>'JSM Eingabe+TW'!$CU$92,'JSM Eingabe+TW'!$CU$92,\" \")","v":" "},168]
[{"$nulls":18},167,199,{"$f":"LARGE('JSM Eingabe+TW'!$DJ$32:$DU$62,S216)","v":1e-06},0,0,{"v":1.830000000000012E-4,"d":"0"},1.6700000000000108E-4,null,{"$f":"IF(U216>'JSM Eingabe+TW'!$CU$92,'JSM Eingabe+TW'!$CU$92,\" \")","v":" "},167]
[{"$nulls":18},166,200,{"$f":"LARGE('JSM Eingabe+TW'!$DJ$32:$DU$62,S217)","v":1e-06},0,0,{"v":1.830000000000012E-4,"d":"0"},1.6600000000000108E-4,null,{"$f":"IF(U217>'JSM Eingabe+TW'!$CU$92,'JSM Eingabe+TW'!$CU$92,\" \")","v":" "},166]
[{"$nulls":18},165,201,{"$f":"LARGE('JSM Eingabe+TW'!$DJ$32:$DU$62,S218)","v":1e-06},0,0,{"v":1.830000000000012E-4,"d":"0"},1.6500000000000108E-4,null,{"$f":"IF(U218>'JSM Eingabe+TW'!$CU$92,'JSM Eingabe+TW'!$CU$92,\" \")","v":" "},165]
[{"$nulls":18},164,202,{"$f":"LARGE('JSM Eingabe+TW'!$DJ$32:$DU$62,S219)","v":1e-06},0,0,{"v":1.830000000000012E-4,"d":"0"},1.6400000000000106E-4,null,{"$f":"IF(U219>'JSM Eingabe+TW'!$CU$92,'JSM Eingabe+TW'!$CU$92,\" \")","v":" "},164]
[{"$nulls":18},163,203,{"$f":"LARGE('JSM Eingabe+TW'!$DJ$32:$DU$62,S220)","v":1e-06},0,0,{"v":1.830000000000012E-4,"d":"0"},1.6300000000000106E-4,{"$f":"P$34","v":0},{"$f":"IF(U220>'JSM Eingabe+TW'!$CU$92,'JSM Eingabe+TW'!$CU$92,\" \")","v":" "},163]
[{"$nulls":18},162,204,{"$f":"LARGE('JSM Eingabe+TW'!$DJ$32:$DU$62,S221)","v":1e-06},0,0,{"v":1.830000000000012E-4,"d":"0"},1.6200000000000106E-4,null,{"$f":"IF(U221>'JSM Eingabe+TW'!$CU$92,'JSM Eingabe+TW'!$CU$92,\" \")","v":" "},162]
[{"$nulls":18},161,205,{"$f":"LARGE('JSM Eingabe+TW'!$DJ$32:$DU$62,S222)","v":1e-06},0,0,{"v":1.830000000000012E-4,"d":"0"},1.6100000000000104E-4,null,{"$f":"IF(U222>'JSM Eingabe+TW'!$CU$92,'JSM Eingabe+TW'!$CU$92,\" \")","v":" "},161]
[{"$nulls":18},160,206,{"$f":"LARGE('JSM Eingabe+TW'!$DJ$32:$DU$62,S223)","v":1e-06},0,0,{"v":1.830000000000012E-4,"d":"0"},1.6000000000000104E-4,null,{"$f":"IF(U223>'JSM Eingabe+TW'!$CU$92,'JSM Eingabe+TW'!$CU$92,\" \")","v":" "},160]
[{"$nulls":18},159,207,{"$f":"LARGE('JSM Eingabe+TW'!$DJ$32:$DU$62,S224)","v":1e-06},0,0,{"v":1.830000000000012E-4,"d":"0"},1.5900000000000105E-4,null,{"$f":"IF(U224>'JSM Eingabe+TW'!$CU$92,'JSM Eingabe+TW'!$CU$92,\" \")","v":" "},159]
[{"$nulls":18},158,208,{"$f":"LARGE('JSM Eingabe+TW'!$DJ$32:$DU$62,S225)","v":1e-06},0,0,{"v":1.830000000000012E-4,"d":"0"},1.5800000000000102E-4,{"$f":"P$34","v":0},{"$f":"IF(U225>'JSM Eingabe+TW'!$CU$92,'JSM Eingabe+TW'!$CU$92,\" \")","v":" "},158]
[{"$nulls":18},157,209,{"$f":"LARGE('JSM Eingabe+TW'!$DJ$32:$DU$62,S226)","v":1e-06},0,0,{"v":1.830000000000012E-4,"d":"0"},1.5700000000000102E-4,null,{"$f":"IF(U226>'JSM Eingabe+TW'!$CU$92,'JSM Eingabe+TW'!$CU$92,\" \")","v":" "},157]
[{"$nulls":18},156,210,{"$f":"LARGE('JSM Eingabe+TW'!$DJ$32:$DU$62,S227)","v":1e-06},0,0,{"v":1.830000000000012E-4,"d":"0"},1.5600000000000103E-4,null,{"$f":"IF(U227>'JSM Eingabe+TW'!$CU$92,'JSM Eingabe+TW'!$CU$92,\" \")","v":" "},156]
[{"$nulls":18},155,211,{"$f":"LARGE('JSM Eingabe+TW'!$DJ$32:$DU$62,S228)","v":1e-06},0,0,{"v":1.830000000000012E-4,"d":"0"},1.55000000000001E-4,null,{"$f":"IF(U228>'JSM Eingabe+TW'!$CU$92,'JSM Eingabe+TW'!$CU$92,\" \")","v":" "},155]
[{"$nulls":18},154,212,{"$f":"LARGE('JSM Eingabe+TW'!$DJ$32:$DU$62,S229)","v":1e-06},0,0,{"v":1.830000000000012E-4,"d":"0"},0.000154000000000001,null,{"$f":"IF(U229>'JSM Eingabe+TW'!$CU$92,'JSM Eingabe+TW'!$CU$92,\" \")","v":" "},154]
[{"$nulls":18},153,213,{"$f":"LARGE('JSM Eingabe+TW'!$DJ$32:$DU$62,S230)","v":1e-06},0,0,{"v":1.830000000000012E-4,"d":"0"},0.000153000000000001,{"$f":"P$34","v":0},{"$f":"IF(U230>'JSM Eingabe+TW'!$CU$92,'JSM Eingabe+TW'!$CU$92,\" \")","v":" "},153]
[{"$nulls":18},152,214,{"$f":"LARGE('JSM Eingabe+TW'!$DJ$32:$DU$62,S231)","v":1e-06},0,0,{"v":1.830000000000012E-4,"d":"0"},1.5200000000000098E-4,null,{"$f":"IF(U231>'JSM Eingabe+TW'!$CU$92,'JSM Eingabe+TW'!$CU$92,\" \")","v":" "},152]
[{"$nulls":18},151,215,{"$f":"LARGE('JSM Eingabe+TW'!$DJ$32:$DU$62,S232)","v":1e-06},0,0,{"v":1.830000000000012E-4,"d":"0"},0.000151000000000001,null,{"$f":"IF(U232>'JSM Eingabe+TW'!$CU$92,'JSM Eingabe+TW'!$CU$92,\" \")","v":" "},151]
[{"$nulls":18},150,216,{"$f":"LARGE('JSM Eingabe+TW'!$DJ$32:$DU$62,S233)","v":1e-06},0,0,{"v":1.830000000000012E-4,"d":"0"},0.000150000000000001,null,{"$f":"IF(U233>'JSM Eingabe+TW'!$CU$92,'JSM Eingabe+TW'!$CU$92,\" \")","v":" "},150]
[{"$nulls":18},149,217,{"$f":"LARGE('JSM Eingabe+TW'!$DJ$32:$DU$62,S234)","v":1e-06},0,0,{"v":1.830000000000012E-4,"d":"0"},1.4900000000000097E-4,null,{"$f":"IF(U234>'JSM Eingabe+TW'!$CU$92,'JSM Eingabe+TW'!$CU$92,\" \")","v":" "},149]
[{"$nulls":18},148,218,{"$f":"LARGE('JSM Eingabe+TW'!$DJ$32:$DU$62,S235)","v":1e-06},0,0,{"v":1.830000000000012E-4,"d":"0"},1.4800000000000097E-4,{"$f":"P$34","v":0},{"$f":"IF(U235>'JSM Eingabe+TW'!$CU$92,'JSM Eingabe+TW'!$CU$92,\" \")","v":" "},148]
[{"$nulls":18},147,219,{"$f":"LARGE('JSM Eingabe+TW'!$DJ$32:$DU$62,S236)","v":1e-06},0,0,{"v":1.830000000000012E-4,"d":"0"},1.4700000000000097E-4,null,{"$f":"IF(U236>'JSM Eingabe+TW'!$CU$92,'JSM Eingabe+TW'!$CU$92,\" \")","v":" "},147]
[{"$nulls":18},146,220,{"$f":"LARGE('JSM Eingabe+TW'!$DJ$32:$DU$62,S237)","v":1e-06},0,0,{"v":1.830000000000012E-4,"d":"0"},1.4600000000000095E-4,null,{"$f":"IF(U237>'JSM Eingabe+TW'!$CU$92,'JSM Eingabe+TW'!$CU$92,\" \")","v":" "},146]
[{"$nulls":18},145,221,{"$f":"LARGE('JSM Eingabe+TW'!$DJ$32:$DU$62,S238)","v":1e-06},0,0,{"v":1.830000000000012E-4,"d":"0"},1.4500000000000095E-4,null,{"$f":"IF(U238>'JSM Eingabe+TW'!$CU$92,'JSM Eingabe+TW'!$CU$92,\" \")","v":" "},145]
[{"$nulls":18},144,222,{"$f":"LARGE('JSM Eingabe+TW'!$DJ$32:$DU$62,S239)","v":1e-06},0,0,{"v":1.830000000000012E-4,"d":"0"},1.4400000000000095E-4,null,{"$f":"IF(U239>'JSM Eingabe+TW'!$CU$92,'JSM Eingabe+TW'!$CU$92,\" \")","v":" "},144]
[{"$nulls":18},143,223,{"$f":"LARGE('JSM Eingabe+TW'!$DJ$32:$DU$62,S240)","v":1e-06},0,0,{"v":1.830000000000012E-4,"d":"0"},1.4300000000000093E-4,{"$f":"P$34","v":0},{"$f":"IF(U240>'JSM Eingabe+TW'!$CU$92,'JSM Eingabe+TW'!$CU$92,\" \")","v":" "},143]
[{"$nulls":18},142,224,{"$f":"LARGE('JSM Eingabe+TW'!$DJ$32:$DU$62,S241)","v":1e-06},0,0,{"v":1.830000000000012E-4,"d":"0"},1.4200000000000093E-4,null,{"$f":"IF(U241>'JSM Eingabe+TW'!$CU$92,'JSM Eingabe+TW'!$CU$92,\" \")","v":" "},142]
[{"$nulls":18},141,225,{"$f":"LARGE('JSM Eingabe+TW'!$DJ$32:$DU$62,S242)","v":1e-06},0,0,{"v":1.830000000000012E-4,"d":"0"},1.4100000000000091E-4,null,{"$f":"IF(U242>'JSM Eingabe+TW'!$CU$92,'JSM Eingabe+TW'!$CU$92,\" \")","v":" "},141]
[{"$nulls":18},140,226,{"$f":"LARGE('JSM Eingabe+TW'!$DJ$32:$DU$62,S243)","v":1e-06},0,0,{"v":1.830000000000012E-4,"d":"0"},1.4000000000000091E-4,null,{"$f":"IF(U243>'JSM Eingabe+TW'!$CU$92,'JSM Eingabe+TW'!$CU$92,\" \")","v":" "},140]
[{"$nulls":18},139,227,{"$f":"LARGE('JSM Eingabe+TW'!$DJ$32:$DU$62,S244)","v":1e-06},0,0,{"v":1.830000000000012E-4,"d":"0"},1.3900000000000091E-4,null,{"$f":"IF(U244>'JSM Eingabe+TW'!$CU$92,'JSM Eingabe+TW'!$CU$92,\" \")","v":" "},139]
[{"$nulls":18},138,228,{"$f":"LARGE('JSM Eingabe+TW'!$DJ$32:$DU$62,S245)","v":1e-06},0,0,{"v":1.830000000000012E-4,"d":"0"},1.3800000000000089E-4,{"$f":"P$34","v":0},{"$f":"IF(U245>'JSM Eingabe+TW'!$CU$92,'JSM Eingabe+TW'!$CU$92,\" \")","v":" "},138]
[{"$nulls":18},137,229,{"$f":"LARGE('JSM Eingabe+TW'!$DJ$32:$DU$62,S246)","v":1e-06},0,0,{"v":1.830000000000012E-4,"d":"0"},1.3700000000000089E-4,null,{"$f":"IF(U246>'JSM Eingabe+TW'!$CU$92,'JSM Eingabe+TW'!$CU$92,\" \")","v":" "},137]
[{"$nulls":18},136,230,{"$f":"LARGE('JSM Eingabe+TW'!$DJ$32:$DU$62,S247)","v":1e-06},0,0,{"v":1.830000000000012E-4,"d":"0"},1.3600000000000089E-4,null,{"$f":"IF(U247>'JSM Eingabe+TW'!$CU$92,'JSM Eingabe+TW'!$CU$92,\" \")","v":" "},136]
[{"$nulls":18},135,231,{"$f":"LARGE('JSM Eingabe+TW'!$DJ$32:$DU$62,S248)","v":1e-06},0,0,{"v":1.830000000000012E-4,"d":"0"},1.3500000000000087E-4,null,{"$f":"IF(U248>'JSM Eingabe+TW'!$CU$92,'JSM Eingabe+TW'!$CU$92,\" \")","v":" "},135]
[{"$nulls":18},134,232,{"$f":"LARGE('JSM Eingabe+TW'!$DJ$32:$DU$62,S249)","v":1e-06},0,0,{"v":1.830000000000012E-4,"d":"0"},1.3400000000000087E-4,null,{"$f":"IF(U249>'JSM Eingabe+TW'!$CU$92,'JSM Eingabe+TW'!$CU$92,\" \")","v":" "},134]
[{"$nulls":18},133,233,{"$f":"LARGE('JSM Eingabe+TW'!$DJ$32:$DU$62,S250)","v":1e-06},0,0,{"v":1.830000000000012E-4,"d":"0"},1.3300000000000087E-4,{"$f":"P$34","v":0},{"$f":"IF(U250>'JSM Eingabe+TW'!$CU$92,'JSM Eingabe+TW'!$CU$92,\" \")","v":" "},133]
[{"$nulls":18},132,234,{"$f":"LARGE('JSM Eingabe+TW'!$DJ$32:$DU$62,S251)","v":1e-06},0,0,{"v":1.830000000000012E-4,"d":"0"},1.3200000000000085E-4,null,{"$f":"IF(U251>'JSM Eingabe+TW'!$CU$92,'JSM Eingabe+TW'!$CU$92,\" \")","v":" "},132]
[{"$nulls":18},131,235,{"$f":"LARGE('JSM Eingabe+TW'!$DJ$32:$DU$62,S252)","v":1e-06},0,0,{"v":1.830000000000012E-4,"d":"0"},1.3100000000000085E-4,null,{"$f":"IF(U252>'JSM Eingabe+TW'!$CU$92,'JSM Eingabe+TW'!$CU$92,\" \")","v":" "},131]
[{"$nulls":18},130,236,{"$f":"LARGE('JSM Eingabe+TW'!$DJ$32:$DU$62,S253)","v":1e-06},0,0,{"v":1.830000000000012E-4,"d":"0"},1.3000000000000086E-4,null,{"$f":"IF(U253>'JSM Eingabe+TW'!$CU$92,'JSM Eingabe+TW'!$CU$92,\" \")","v":" "},130]
[{"$nulls":18},129,237,{"$f":"LARGE('JSM Eingabe+TW'!$DJ$32:$DU$62,S254)","v":1e-06},0,0,{"v":1.830000000000012E-4,"d":"0"},1.2900000000000083E-4,null,{"$f":"IF(U254>'JSM Eingabe+TW'!$CU$92,'JSM Eingabe+TW'!$CU$92,\" \")","v":" "},129]
[{"$nulls":18},128,238,{"$f":"LARGE('JSM Eingabe+TW'!$DJ$32:$DU$62,S255)","v":1e-06},0,0,{"v":1.830000000000012E-4,"d":"0"},1.2800000000000083E-4,{"$f":"P$34","v":0},{"$f":"IF(U255>'JSM Eingabe+TW'!$CU$92,'JSM Eingabe+TW'!$CU$92,\" \")","v":" "},128]
[{"$nulls":18},127,239,{"$f":"LARGE('JSM Eingabe+TW'!$DJ$32:$DU$62,S256)","v":1e-06},0,0,{"v":1.830000000000012E-4,"d":"0"},1.2700000000000084E-4,null,{"$f":"IF(U256>'JSM Eingabe+TW'!$CU$92,'JSM Eingabe+TW'!$CU$92,\" \")","v":" "},127]
[{"$nulls":18},126,240,{"$f":"LARGE('JSM Eingabe+TW'!$DJ$32:$DU$62,S257)","v":1e-06},0,0,{"v":1.830000000000012E-4,"d":"0"},1.2600000000000081E-4,null,{"$f":"IF(U257>'JSM Eingabe+TW'!$CU$92,'JSM Eingabe+TW'!$CU$92,\" \")","v":" "},126]
[{"$nulls":18},125,241,{"$f":"LARGE('JSM Eingabe+TW'!$DJ$32:$DU$62,S258)","v":1e-06},0,0,{"v":1.830000000000012E-4,"d":"0"},1.2500000000000082E-4,null,{"$f":"IF(U258>'JSM Eingabe+TW'!$CU$92,'JSM Eingabe+TW'!$CU$92,\" \")","v":" "},125]
[{"$nulls":18},124,242,{"$f":"LARGE('JSM Eingabe+TW'!$DJ$32:$DU$62,S259)","v":1e-06},0,0,{"v":1.830000000000012E-4,"d":"0"},1.2400000000000082E-4,null,{"$f":"IF(U259>'JSM Eingabe+TW'!$CU$92,'JSM Eingabe+TW'!$CU$92,\" \")","v":" "},124]
[{"$nulls":18},123,243,{"$f":"LARGE('JSM Eingabe+TW'!$DJ$32:$DU$62,S260)","v":1e-06},0,0,{"v":1.830000000000012E-4,"d":"0"},1.2300000000000079E-4,{"$f":"P$34","v":0},{"$f":"IF(U260>'JSM Eingabe+TW'!$CU$92,'JSM Eingabe+TW'!$CU$92,\" \")","v":" "},123]
[{"$nulls":18},122,244,{"$f":"LARGE('JSM Eingabe+TW'!$DJ$32:$DU$62,S261)","v":1e-06},0,0,{"v":1.830000000000012E-4,"d":"0"},1.220000000000008E-4,null,{"$f":"IF(U261>'JSM Eingabe+TW'!$CU$92,'JSM Eingabe+TW'!$CU$92,\" \")","v":" "},122]
[{"$nulls":18},121,245,{"$f":"LARGE('JSM Eingabe+TW'!$DJ$32:$DU$62,S262)","v":1e-06},0,0,{"v":1.830000000000012E-4,"d":"0"},1.2100000000000079E-4,null,{"$f":"IF(U262>'JSM Eingabe+TW'!$CU$92,'JSM Eingabe+TW'!$CU$92,\" \")","v":" "},121]
[{"$nulls":18},120,246,{"$f":"LARGE('JSM Eingabe+TW'!$DJ$32:$DU$62,S263)","v":1e-06},0,0,{"v":1.830000000000012E-4,"d":"0"},1.2000000000000078E-4,null,{"$f":"IF(U263>'JSM Eingabe+TW'!$CU$92,'JSM Eingabe+TW'!$CU$92,\" \")","v":" "},120]
[{"$nulls":18},119,247,{"$f":"LARGE('JSM Eingabe+TW'!$DJ$32:$DU$62,S264)","v":1e-06},0,0,{"v":1.830000000000012E-4,"d":"0"},1.1900000000000078E-4,null,{"$f":"IF(U264>'JSM Eingabe+TW'!$CU$92,'JSM Eingabe+TW'!$CU$92,\" \")","v":" "},119]
[{"$nulls":18},118,248,{"$f":"LARGE('JSM Eingabe+TW'!$DJ$32:$DU$62,S265)","v":1e-06},0,0,{"v":1.830000000000012E-4,"d":"0"},1.1800000000000077E-4,{"$f":"P$34","v":0},{"$f":"IF(U265>'JSM Eingabe+TW'!$CU$92,'JSM Eingabe+TW'!$CU$92,\" \")","v":" "},118]
[{"$nulls":18},117,249,{"$f":"LARGE('JSM Eingabe+TW'!$DJ$32:$DU$62,S266)","v":1e-06},0,0,{"v":1.830000000000012E-4,"d":"0"},1.1700000000000076E-4,null,{"$f":"IF(U266>'JSM Eingabe+TW'!$CU$92,'JSM Eingabe+TW'!$CU$92,\" \")","v":" "},117]
[{"$nulls":18},116,250,{"$f":"LARGE('JSM Eingabe+TW'!$DJ$32:$DU$62,S267)","v":1e-06},0,0,{"v":1.830000000000012E-4,"d":"0"},1.1600000000000076E-4,null,{"$f":"IF(U267>'JSM Eingabe+TW'!$CU$92,'JSM Eingabe+TW'!$CU$92,\" \")","v":" "},116]
[{"$nulls":18},115,251,{"$f":"LARGE('JSM Eingabe+TW'!$DJ$32:$DU$62,S268)","v":1e-06},0,0,{"v":1.830000000000012E-4,"d":"0"},1.1500000000000075E-4,null,{"$f":"IF(U268>'JSM Eingabe+TW'!$CU$92,'JSM Eingabe+TW'!$CU$92,\" \")","v":" "},115]
[{"$nulls":18},114,252,{"$f":"LARGE('JSM Eingabe+TW'!$DJ$32:$DU$62,S269)","v":1e-06},0,0,{"v":1.830000000000012E-4,"d":"0"},1.1400000000000074E-4,null,{"$f":"IF(U269>'JSM Eingabe+TW'!$CU$92,'JSM Eingabe+TW'!$CU$92,\" \")","v":" "},114]
[{"$nulls":18},113,253,{"$f":"LARGE('JSM Eingabe+TW'!$DJ$32:$DU$62,S270)","v":1e-06},0,0,{"v":1.830000000000012E-4,"d":"0"},1.1300000000000074E-4,{"$f":"P$34","v":0},{"$f":"IF(U270>'JSM Eingabe+TW'!$CU$92,'JSM Eingabe+TW'!$CU$92,\" \")","v":" "},113]
[{"$nulls":18},112,254,{"$f":"LARGE('JSM Eingabe+TW'!$DJ$32:$DU$62,S271)","v":1e-06},0,0,{"v":1.830000000000012E-4,"d":"0"},1.1200000000000073E-4,null,{"$f":"IF(U271>'JSM Eingabe+TW'!$CU$92,'JSM Eingabe+TW'!$CU$92,\" \")","v":" "},112]
[{"$nulls":18},111,255,{"$f":"LARGE('JSM Eingabe+TW'!$DJ$32:$DU$62,S272)","v":1e-06},0,0,{"v":1.830000000000012E-4,"d":"0"},1.1100000000000072E-4,null,{"$f":"IF(U272>'JSM Eingabe+TW'!$CU$92,'JSM Eingabe+TW'!$CU$92,\" \")","v":" "},111]
[{"$nulls":18},110,256,{"$f":"LARGE('JSM Eingabe+TW'!$DJ$32:$DU$62,S273)","v":1e-06},0,0,{"v":1.830000000000012E-4,"d":"0"},1.1000000000000072E-4,null,{"$f":"IF(U273>'JSM Eingabe+TW'!$CU$92,'JSM Eingabe+TW'!$CU$92,\" \")","v":" "},110]
[{"$nulls":18},109,257,{"$f":"LARGE('JSM Eingabe+TW'!$DJ$32:$DU$62,S274)","v":1e-06},{"$f":"IF(T274=V$13,LARGE(U$18:U$382,1),0)","v":0},{"$f":"IF(T274=W$13,LARGE(U$18:U$382,1),0)","v":0},{"$f":"P$35","v":{"v":1.830000000000012E-4,"d":"0"}},{"$f":"IF(T274<=$W$13,U274,((U$15-P$34)/(365-W$13)*AB274)+P$34)","v":1.0900000000000071E-4},null,{"$f":"IF(U274>'JSM Eingabe+TW'!$CU$92,'JSM Eingabe+TW'!$CU$92,\" \")","v":" "},109]
[{"$nulls":18},108,258,{"$f":"LARGE('JSM Eingabe+TW'!$DJ$32:$DU$62,S275)","v":1e-06},0,0,{"v":1.830000000000012E-4,"d":"0"},1.080000000000007E-4,{"$f":"P$34","v":0},{"$f":"IF(U275>'JSM Eingabe+TW'!$CU$92,'JSM Eingabe+TW'!$CU$92,\" \")","v":" "},{"$f":"IF(T275<=W$13,0,S275)","v":108}]
[{"$nulls":18},107,259,{"$f":"LARGE('JSM Eingabe+TW'!$DJ$32:$DU$62,S276)","v":1e-06},0,0,{"v":1.830000000000012E-4,"d":"0"},1.070000000000007E-4,null,{"$f":"IF(U276>'JSM Eingabe+TW'!$CU$92,'JSM Eingabe+TW'!$CU$92,\" \")","v":" "},107]
[{"$nulls":18},106,260,{"$f":"LARGE('JSM Eingabe+TW'!$DJ$32:$DU$62,S277)","v":1e-06},0,0,{"v":1.830000000000012E-4,"d":"0"},1.0600000000000069E-4,null,{"$f":"IF(U277>'JSM Eingabe+TW'!$CU$92,'JSM Eingabe+TW'!$CU$92,\" \")","v":" "},106]
[{"$nulls":18},105,261,{"$f":"LARGE('JSM Eingabe+TW'!$DJ$32:$DU$62,S278)","v":1e-06},0,0,{"v":1.830000000000012E-4,"d":"0"},1.0500000000000068E-4,null,{"$f":"IF(U278>'JSM Eingabe+TW'!$CU$92,'JSM Eingabe+TW'!$CU$92,\" \")","v":" "},105]
[{"$nulls":18},104,262,{"$f":"LARGE('JSM Eingabe+TW'!$DJ$32:$DU$62,S279)","v":1e-06},0,0,{"v":1.830000000000012E-4,"d":"0"},1.0400000000000068E-4,null,{"$f":"IF(U279>'JSM Eingabe+TW'!$CU$92,'JSM Eingabe+TW'!$CU$92,\" \")","v":" "},104]
[{"$nulls":18},103,263,{"$f":"LARGE('JSM Eingabe+TW'!$DJ$32:$DU$62,S280)","v":1e-06},0,0,{"v":1.830000000000012E-4,"d":"0"},1.0300000000000067E-4,{"$f":"P$34","v":0},{"$f":"IF(U280>'JSM Eingabe+TW'!$CU$92,'JSM Eingabe+TW'!$CU$92,\" \")","v":" "},103]
[{"$nulls":18},102,264,{"$f":"LARGE('JSM Eingabe+TW'!$DJ$32:$DU$62,S281)","v":1e-06},0,0,{"v":1.830000000000012E-4,"d":"0"},1.0200000000000066E-4,null,{"$f":"IF(U281>'JSM Eingabe+TW'!$CU$92,'JSM Eingabe+TW'!$CU$92,\" \")","v":" "},102]
[{"$nulls":18},101,265,{"$f":"LARGE('JSM Eingabe+TW'!$DJ$32:$DU$62,S282)","v":1e-06},0,0,{"v":1.830000000000012E-4,"d":"0"},1.0100000000000065E-4,null,{"$f":"IF(U282>'JSM Eingabe+TW'!$CU$92,'JSM Eingabe+TW'!$CU$92,\" \")","v":" "},101]
[{"$nulls":18},100,266,{"$f":"LARGE('JSM Eingabe+TW'!$DJ$32:$DU$62,S283)","v":1e-06},0,0,{"v":1.830000000000012E-4,"d":"0"},1.0000000000000066E-4,null,{"$f":"IF(U283>'JSM Eingabe+TW'!$CU$92,'JSM Eingabe+TW'!$CU$92,\" \")","v":" "},100]
[{"$nulls":18},99,267,{"$f":"LARGE('JSM Eingabe+TW'!$DJ$32:$DU$62,S284)","v":1e-06},0,0,{"v":1.830000000000012E-4,"d":"0"},9.9000000000000645E-5,null,{"$f":"IF(U284>'JSM Eingabe+TW'!$CU$92,'JSM Eingabe+TW'!$CU$92,\" \")","v":" "},99]
[{"$nulls":18},98,268,{"$f":"LARGE('JSM Eingabe+TW'!$DJ$32:$DU$62,S285)","v":1e-06},0,0,{"v":1.830000000000012E-4,"d":"0"},9.8000000000000634E-5,{"$f":"P$34","v":0},{"$f":"IF(U285>'JSM Eingabe+TW'!$CU$92,'JSM Eingabe+TW'!$CU$92,\" \")","v":" "},98]
[{"$nulls":18},97,269,{"$f":"LARGE('JSM Eingabe+TW'!$DJ$32:$DU$62,S286)","v":1e-06},0,0,{"v":1.830000000000012E-4,"d":"0"},9.7000000000000637E-5,null,{"$f":"IF(U286>'JSM Eingabe+TW'!$CU$92,'JSM Eingabe+TW'!$CU$92,\" \")","v":" "},97]
[{"$nulls":18},96,270,{"$f":"LARGE('JSM Eingabe+TW'!$DJ$32:$DU$62,S287)","v":1e-06},0,0,{"v":1.830000000000012E-4,"d":"0"},9.6000000000000626E-5,null,{"$f":"IF(U287>'JSM Eingabe+TW'!$CU$92,'JSM Eingabe+TW'!$CU$92,\" \")","v":" "},96]
[{"$nulls":18},95,271,{"$f":"LARGE('JSM Eingabe+TW'!$DJ$32:$DU$62,S288)","v":1e-06},0,0,{"v":1.830000000000012E-4,"d":"0"},9.5000000000000615E-5,null,{"$f":"IF(U288>'JSM Eingabe+TW'!$CU$92,'JSM Eingabe+TW'!$CU$92,\" \")","v":" "},95]
[{"$nulls":18},94,272,{"$f":"LARGE('JSM Eingabe+TW'!$DJ$32:$DU$62,S289)","v":1e-06},0,0,{"v":1.830000000000012E-4,"d":"0"},9.4000000000000618E-5,null,{"$f":"IF(U289>'JSM Eingabe+TW'!$CU$92,'JSM Eingabe+TW'!$CU$92,\" \")","v":" "},94]
[{"$nulls":18},93,273,{"$f":"LARGE('JSM Eingabe+TW'!$DJ$32:$DU$62,S290)","v":1e-06},0,0,{"v":1.830000000000012E-4,"d":"0"},9.3000000000000607E-5,{"$f":"P$34","v":0},{"$f":"IF(U290>'JSM Eingabe+TW'!$CU$92,'JSM Eingabe+TW'!$CU$92,\" \")","v":" "},93]
[{"$nulls":18},92,274,{"$f":"LARGE('JSM Eingabe+TW'!$DJ$32:$DU$62,S291)","v":1e-06},0,0,{"v":1.830000000000012E-4,"d":"0"},9.20000000000006e-05,null,{"$f":"IF(U291>'JSM Eingabe+TW'!$CU$92,'JSM Eingabe+TW'!$CU$92,\" \")","v":" "},92]
[{"$nulls":18},91,275,{"$f":"LARGE('JSM Eingabe+TW'!$DJ$32:$DU$62,S292)","v":1e-06},0,0,{"v":1.830000000000012E-4,"d":"0"},9.10000000000006e-05,null,{"$f":"IF(U292>'JSM Eingabe+TW'!$CU$92,'JSM Eingabe+TW'!$CU$92,\" \")","v":" "},91]
[{"$nulls":18},90,276,{"$f":"LARGE('JSM Eingabe+TW'!$DJ$32:$DU$62,S293)","v":1e-06},0,0,{"v":1.830000000000012E-4,"d":"0"},9.0000000000000588E-5,null,{"$f":"IF(U293>'JSM Eingabe+TW'!$CU$92,'JSM Eingabe+TW'!$CU$92,\" \")","v":" "},90]
[{"$nulls":18},89,277,{"$f":"LARGE('JSM Eingabe+TW'!$DJ$32:$DU$62,S294)","v":1e-06},0,0,{"v":1.830000000000012E-4,"d":"0"},8.9000000000000578E-5,null,{"$f":"IF(U294>'JSM Eingabe+TW'!$CU$92,'JSM Eingabe+TW'!$CU$92,\" \")","v":" "},89]
[{"$nulls":18},88,278,{"$f":"LARGE('JSM Eingabe+TW'!$DJ$32:$DU$62,S295)","v":1e-06},0,0,{"v":1.830000000000012E-4,"d":"0"},8.8000000000000567E-5,{"$f":"P$34","v":0},{"$f":"IF(U295>'JSM Eingabe+TW'!$CU$92,'JSM Eingabe+TW'!$CU$92,\" \")","v":" "},88]
[{"$nulls":18},87,279,{"$f":"LARGE('JSM Eingabe+TW'!$DJ$32:$DU$62,S296)","v":1e-06},0,0,{"v":1.830000000000012E-4,"d":"0"},8.700000000000057E-5,null,{"$f":"IF(U296>'JSM Eingabe+TW'!$CU$92,'JSM Eingabe+TW'!$CU$92,\" \")","v":" "},87]
[{"$nulls":18},86,280,{"$f":"LARGE('JSM Eingabe+TW'!$DJ$32:$DU$62,S297)","v":1e-06},0,0,{"v":1.830000000000012E-4,"d":"0"},8.6000000000000559E-5,null,{"$f":"IF(U297>'JSM Eingabe+TW'!$CU$92,'JSM Eingabe+TW'!$CU$92,\" \")","v":" "},86]
[{"$nulls":18},85,281,{"$f":"LARGE('JSM Eingabe+TW'!$DJ$32:$DU$62,S298)","v":1e-06},0,0,{"v":1.830000000000012E-4,"d":"0"},8.5000000000000548E-5,null,{"$f":"IF(U298>'JSM Eingabe+TW'!$CU$92,'JSM Eingabe+TW'!$CU$92,\" \")","v":" "},85]
[{"$nulls":18},84,282,{"$f":"LARGE('JSM Eingabe+TW'!$DJ$32:$DU$62,S299)","v":1e-06},0,0,{"v":1.830000000000012E-4,"d":"0"},8.4000000000000551E-5,null,{"$f":"IF(U299>'JSM Eingabe+TW'!$CU$92,'JSM Eingabe+TW'!$CU$92,\" \")","v":" "},84]
[{"$nulls":18},83,283,{"$f":"LARGE('JSM Eingabe+TW'!$DJ$32:$DU$62,S300)","v":1e-06},0,0,{"v":1.830000000000012E-4,"d":"0"},8.300000000000054E-5,{"$f":"P$34","v":0},{"$f":"IF(U300>'JSM Eingabe+TW'!$CU$92,'JSM Eingabe+TW'!$CU$92,\" \")","v":" "},83]
[{"$nulls":18},82,284,{"$f":"LARGE('JSM Eingabe+TW'!$DJ$32:$DU$62,S301)","v":1e-06},0,0,{"v":1.830000000000012E-4,"d":"0"},8.2000000000000529E-5,null,{"$f":"IF(U301>'JSM Eingabe+TW'!$CU$92,'JSM Eingabe+TW'!$CU$92,\" \")","v":" "},82]
[{"$nulls":18},81,285,{"$f":"LARGE('JSM Eingabe+TW'!$DJ$32:$DU$62,S302)","v":1e-06},0,0,{"v":1.830000000000012E-4,"d":"0"},8.1000000000000532E-5,null,{"$f":"IF(U302>'JSM Eingabe+TW'!$CU$92,'JSM Eingabe+TW'!$CU$92,\" \")","v":" "},81]
[{"$nulls":18},80,286,{"$f":"LARGE('JSM Eingabe+TW'!$DJ$32:$DU$62,S303)","v":1e-06},0,0,{"v":1.830000000000012E-4,"d":"0"},8.0000000000000522E-5,null,{"$f":"IF(U303>'JSM Eingabe+TW'!$CU$92,'JSM Eingabe+TW'!$CU$92,\" \")","v":" "},80]
[{"$nulls":18},79,287,{"$f":"LARGE('JSM Eingabe+TW'!$DJ$32:$DU$62,S304)","v":1e-06},0,0,{"v":1.830000000000012E-4,"d":"0"},7.9000000000000511E-5,null,{"$f":"IF(U304>'JSM Eingabe+TW'!$CU$92,'JSM Eingabe+TW'!$CU$92,\" \")","v":" "},79]
[{"$nulls":18},78,288,{"$f":"LARGE('JSM Eingabe+TW'!$DJ$32:$DU$62,S305)","v":1e-06},0,0,{"v":1.830000000000012E-4,"d":"0"},7.8000000000000514E-5,{"$f":"P$34","v":0},{"$f":"IF(U305>'JSM Eingabe+TW'!$CU$92,'JSM Eingabe+TW'!$CU$92,\" \")","v":" "},78]
[{"$nulls":18},77,289,{"$f":"LARGE('JSM Eingabe+TW'!$DJ$32:$DU$62,S306)","v":1e-06},0,0,{"v":1.830000000000012E-4,"d":"0"},7.70000000000005e-05,null,{"$f":"IF(U306>'JSM Eingabe+TW'!$CU$92,'JSM Eingabe+TW'!$CU$92,\" \")","v":" "},77]
[{"$nulls":18},76,290,{"$f":"LARGE('JSM Eingabe+TW'!$DJ$32:$DU$62,S307)","v":1e-06},0,0,{"v":1.830000000000012E-4,"d":"0"},7.6000000000000492E-5,null,{"$f":"IF(U307>'JSM Eingabe+TW'!$CU$92,'JSM Eingabe+TW'!$CU$92,\" \")","v":" "},76]
[{"$nulls":18},75,291,{"$f":"LARGE('JSM Eingabe+TW'!$DJ$32:$DU$62,S308)","v":1e-06},0,0,{"v":1.830000000000012E-4,"d":"0"},7.50000000000005e-05,null,{"$f":"IF(U308>'JSM Eingabe+TW'!$CU$92,'JSM Eingabe+TW'!$CU$92,\" \")","v":" "},75]
[{"$nulls":18},74,292,{"$f":"LARGE('JSM Eingabe+TW'!$DJ$32:$DU$62,S309)","v":1e-06},0,0,{"v":1.830000000000012E-4,"d":"0"},7.4000000000000484E-5,null,{"$f":"IF(U309>'JSM Eingabe+TW'!$CU$92,'JSM Eingabe+TW'!$CU$92,\" \")","v":" "},74]
[{"$nulls":18},73,293,{"$f":"LARGE('JSM Eingabe+TW'!$DJ$32:$DU$62,S310)","v":1e-06},0,0,{"v":1.830000000000012E-4,"d":"0"},7.3000000000000473E-5,{"$f":"P$34","v":0},{"$f":"IF(U310>'JSM Eingabe+TW'!$CU$92,'JSM Eingabe+TW'!$CU$92,\" \")","v":" "},73]
[{"$nulls":18},72,294,{"$f":"LARGE('JSM Eingabe+TW'!$DJ$32:$DU$62,S311)","v":1e-06},0,0,{"v":1.830000000000012E-4,"d":"0"},7.2000000000000476E-5,null,{"$f":"IF(U311>'JSM Eingabe+TW'!$CU$92,'JSM Eingabe+TW'!$CU$92,\" \")","v":" "},72]
[{"$nulls":18},71,295,{"$f":"LARGE('JSM Eingabe+TW'!$DJ$32:$DU$62,S312)","v":1e-06},0,0,{"v":1.830000000000012E-4,"d":"0"},7.1000000000000465E-5,null,{"$f":"IF(U312>'JSM Eingabe+TW'!$CU$92,'JSM Eingabe+TW'!$CU$92,\" \")","v":" "},71]
[{"$nulls":18},70,296,{"$f":"LARGE('JSM Eingabe+TW'!$DJ$32:$DU$62,S313)","v":1e-06},0,0,{"v":1.830000000000012E-4,"d":"0"},7.0000000000000455E-5,null,{"$f":"IF(U313>'JSM Eingabe+TW'!$CU$92,'JSM Eingabe+TW'!$CU$92,\" \")","v":" "},70]
[{"$nulls":18},69,297,{"$f":"LARGE('JSM Eingabe+TW'!$DJ$32:$DU$62,S314)","v":1e-06},0,0,{"v":1.830000000000012E-4,"d":"0"},6.9000000000000444E-5,null,{"$f":"IF(U314>'JSM Eingabe+TW'!$CU$92,'JSM Eingabe+TW'!$CU$92,\" \")","v":" "},69]
[{"$nulls":18},68,298,{"$f":"LARGE('JSM Eingabe+TW'!$DJ$32:$DU$62,S315)","v":1e-06},0,0,{"v":1.830000000000012E-4,"d":"0"},6.8000000000000447E-5,{"$f":"P$34","v":0},{"$f":"IF(U315>'JSM Eingabe+TW'!$CU$92,'JSM Eingabe+TW'!$CU$92,\" \")","v":" "},68]
[{"$nulls":18},67,299,{"$f":"LARGE('JSM Eingabe+TW'!$DJ$32:$DU$62,S316)","v":1e-06},0,0,{"v":1.830000000000012E-4,"d":"0"},6.7000000000000436E-5,null,{"$f":"IF(U316>'JSM Eingabe+TW'!$CU$92,'JSM Eingabe+TW'!$CU$92,\" \")","v":" "},67]
[{"$nulls":18},66,300,{"$f":"LARGE('JSM Eingabe+TW'!$DJ$32:$DU$62,S317)","v":1e-06},0,0,{"v":1.830000000000012E-4,"d":"0"},6.6000000000000425E-5,null,{"$f":"IF(U317>'JSM Eingabe+TW'!$CU$92,'JSM Eingabe+TW'!$CU$92,\" \")","v":" "},66]
[{"$nulls":18},65,301,{"$f":"LARGE('JSM Eingabe+TW'!$DJ$32:$DU$62,S318)","v":1e-06},0,0,{"v":1.830000000000012E-4,"d":"0"},6.5000000000000428E-5,null,{"$f":"IF(U318>'JSM Eingabe+TW'!$CU$92,'JSM Eingabe+TW'!$CU$92,\" \")","v":" "},65]
[{"$nulls":18},64,302,{"$f":"LARGE('JSM Eingabe+TW'!$DJ$32:$DU$62,S319)","v":1e-06},0,0,{"v":1.830000000000012E-4,"d":"0"},6.4000000000000417E-5,null,{"$f":"IF(U319>'JSM Eingabe+TW'!$CU$92,'JSM Eingabe+TW'!$CU$92,\" \")","v":" "},64]
[{"$nulls":18},63,303,{"$f":"LARGE('JSM Eingabe+TW'!$DJ$32:$DU$62,S320)","v":1e-06},0,0,{"v":1.830000000000012E-4,"d":"0"},6.30000000000004e-05,{"$f":"P$34","v":0},{"$f":"IF(U320>'JSM Eingabe+TW'!$CU$92,'JSM Eingabe+TW'!$CU$92,\" \")","v":" "},63]
[{"$nulls":18},62,304,{"$f":"LARGE('JSM Eingabe+TW'!$DJ$32:$DU$62,S321)","v":1e-06},0,0,{"v":1.830000000000012E-4,"d":"0"},6.2000000000000409E-5,null,{"$f":"IF(U321>'JSM Eingabe+TW'!$CU$92,'JSM Eingabe+TW'!$CU$92,\" \")","v":" "},62]
[{"$nulls":18},61,305,{"$f":"LARGE('JSM Eingabe+TW'!$DJ$32:$DU$62,S322)","v":1e-06},0,0,{"v":1.830000000000012E-4,"d":"0"},6.10000000000004e-05,null,{"$f":"IF(U322>'JSM Eingabe+TW'!$CU$92,'JSM Eingabe+TW'!$CU$92,\" \")","v":" "},61]
[{"$nulls":18},60,306,{"$f":"LARGE('JSM Eingabe+TW'!$DJ$32:$DU$62,S323)","v":1e-06},0,0,{"v":1.830000000000012E-4,"d":"0"},6.0000000000000388E-5,null,{"$f":"IF(U323>'JSM Eingabe+TW'!$CU$92,'JSM Eingabe+TW'!$CU$92,\" \")","v":" "},60]
[{"$nulls":18},59,307,{"$f":"LARGE('JSM Eingabe+TW'!$DJ$32:$DU$62,S324)","v":1e-06},0,0,{"v":1.830000000000012E-4,"d":"0"},5.9000000000000384E-5,null,{"$f":"IF(U324>'JSM Eingabe+TW'!$CU$92,'JSM Eingabe+TW'!$CU$92,\" \")","v":" "},59]
[{"$nulls":18},58,308,{"$f":"LARGE('JSM Eingabe+TW'!$DJ$32:$DU$62,S325)","v":1e-06},0,0,{"v":1.830000000000012E-4,"d":"0"},5.800000000000038E-5,{"$f":"P$34","v":0},{"$f":"IF(U325>'JSM Eingabe+TW'!$CU$92,'JSM Eingabe+TW'!$CU$92,\" \")","v":" "},58]
[{"$nulls":18},57,309,{"$f":"LARGE('JSM Eingabe+TW'!$DJ$32:$DU$62,S326)","v":1e-06},0,0,{"v":1.830000000000012E-4,"d":"0"},5.7000000000000369E-5,null,{"$f":"IF(U326>'JSM Eingabe+TW'!$CU$92,'JSM Eingabe+TW'!$CU$92,\" \")","v":" "},57]
[{"$nulls":18},56,310,{"$f":"LARGE('JSM Eingabe+TW'!$DJ$32:$DU$62,S327)","v":1e-06},0,0,{"v":1.830000000000012E-4,"d":"0"},5.6000000000000365E-5,null,{"$f":"IF(U327>'JSM Eingabe+TW'!$CU$92,'JSM Eingabe+TW'!$CU$92,\" \")","v":" "},56]
[{"$nulls":18},55,311,{"$f":"LARGE('JSM Eingabe+TW'!$DJ$32:$DU$62,S328)","v":1e-06},0,0,{"v":1.830000000000012E-4,"d":"0"},5.5000000000000361E-5,null,{"$f":"IF(U328>'JSM Eingabe+TW'!$CU$92,'JSM Eingabe+TW'!$CU$92,\" \")","v":" "},55]
[{"$nulls":18},54,312,{"$f":"LARGE('JSM Eingabe+TW'!$DJ$32:$DU$62,S329)","v":1e-06},0,0,{"v":1.830000000000012E-4,"d":"0"},5.400000000000035E-5,null,{"$f":"IF(U329>'JSM Eingabe+TW'!$CU$92,'JSM Eingabe+TW'!$CU$92,\" \")","v":" "},54]
[{"$nulls":18},53,313,{"$f":"LARGE('JSM Eingabe+TW'!$DJ$32:$DU$62,S330)","v":1e-06},0,0,{"v":1.830000000000012E-4,"d":"0"},5.3000000000000346E-5,{"$f":"P$34","v":0},{"$f":"IF(U330>'JSM Eingabe+TW'!$CU$92,'JSM Eingabe+TW'!$CU$92,\" \")","v":" "},53]
[{"$nulls":18},52,314,{"$f":"LARGE('JSM Eingabe+TW'!$DJ$32:$DU$62,S331)","v":1e-06},0,0,{"v":1.830000000000012E-4,"d":"0"},5.2000000000000342E-5,null,{"$f":"IF(U331>'JSM Eingabe+TW'!$CU$92,'JSM Eingabe+TW'!$CU$92,\" \")","v":" "},52]
[{"$nulls":18},51,315,{"$f":"LARGE('JSM Eingabe+TW'!$DJ$32:$DU$62,S332)","v":1e-06},0,0,{"v":1.830000000000012E-4,"d":"0"},5.1000000000000332E-5,null,{"$f":"IF(U332>'JSM Eingabe+TW'!$CU$92,'JSM Eingabe+TW'!$CU$92,\" \")","v":" "},51]
[{"$nulls":18},50,316,{"$f":"LARGE('JSM Eingabe+TW'!$DJ$32:$DU$62,S333)","v":1e-06},0,0,{"v":1.830000000000012E-4,"d":"0"},5.0000000000000328E-5,null,{"$f":"IF(U333>'JSM Eingabe+TW'!$CU$92,'JSM Eingabe+TW'!$CU$92,\" \")","v":" "},50]
[{"$nulls":18},49,317,{"$f":"LARGE('JSM Eingabe+TW'!$DJ$32:$DU$62,S334)","v":1e-06},0,0,{"v":1.830000000000012E-4,"d":"0"},4.9000000000000317E-5,null,{"$f":"IF(U334>'JSM Eingabe+TW'!$CU$92,'JSM Eingabe+TW'!$CU$92,\" \")","v":" "},49]
[{"$nulls":18},48,318,{"$f":"LARGE('JSM Eingabe+TW'!$DJ$32:$DU$62,S335)","v":1e-06},0,0,{"v":1.830000000000012E-4,"d":"0"},4.8000000000000313E-5,{"$f":"P$34","v":0},{"$f":"IF(U335>'JSM Eingabe+TW'!$CU$92,'JSM Eingabe+TW'!$CU$92,\" \")","v":" "},48]
[{"$nulls":18},47,319,{"$f":"LARGE('JSM Eingabe+TW'!$DJ$32:$DU$62,S336)","v":1e-06},0,0,{"v":1.830000000000012E-4,"d":"0"},4.7000000000000309E-5,null,{"$f":"IF(U336>'JSM Eingabe+TW'!$CU$92,'JSM Eingabe+TW'!$CU$92,\" \")","v":" "},47]
[{"$nulls":18},46,320,{"$f":"LARGE('JSM Eingabe+TW'!$DJ$32:$DU$62,S337)","v":1e-06},0,0,{"v":1.830000000000012E-4,"d":"0"},4.60000000000003e-05,null,{"$f":"IF(U337>'JSM Eingabe+TW'!$CU$92,'JSM Eingabe+TW'!$CU$92,\" \")","v":" "},46]
[{"$nulls":18},45,321,{"$f":"LARGE('JSM Eingabe+TW'!$DJ$32:$DU$62,S338)","v":1e-06},{"$f":"IF(T338=V$13,LARGE(U$18:U$382,1),0)","v":0},{"$f":"IF(T338=W$13,LARGE(U$18:U$382,1),0)","v":0},{"$f":"P$35","v":{"v":1.830000000000012E-4,"d":"0"}},{"$f":"IF(T338<=$W$13,U338,((U$15-P$34)/(365-W$13)*AB338)+P$34)","v":4.5000000000000294E-5},null,{"$f":"IF(U338>'JSM Eingabe+TW'!$CU$92,'JSM Eingabe+TW'!$CU$92,\" \")","v":" "},45]
[{"$nulls":18},44,322,{"$f":"LARGE('JSM Eingabe+TW'!$DJ$32:$DU$62,S339)","v":1e-06},0,0,{"v":1.830000000000012E-4,"d":"0"},4.4000000000000283E-5,null,{"$f":"IF(U339>'JSM Eingabe+TW'!$CU$92,'JSM Eingabe+TW'!$CU$92,\" \")","v":" "},{"$f":"IF(T339<=W$13,0,S339)","v":44}]
[{"$nulls":18},43,323,{"$f":"LARGE('JSM Eingabe+TW'!$DJ$32:$DU$62,S340)","v":1e-06},0,0,{"v":1.830000000000012E-4,"d":"0"},4.3000000000000279E-5,{"$f":"P$34","v":0},{"$f":"IF(U340>'JSM Eingabe+TW'!$CU$92,'JSM Eingabe+TW'!$CU$92,\" \")","v":" "},43]
[{"$nulls":18},42,324,{"$f":"LARGE('JSM Eingabe+TW'!$DJ$32:$DU$62,S341)","v":1e-06},0,0,{"v":1.830000000000012E-4,"d":"0"},4.2000000000000276E-5,null,{"$f":"IF(U341>'JSM Eingabe+TW'!$CU$92,'JSM Eingabe+TW'!$CU$92,\" \")","v":" "},42]
[{"$nulls":18},41,325,{"$f":"LARGE('JSM Eingabe+TW'!$DJ$32:$DU$62,S342)","v":1e-06},0,0,{"v":1.830000000000012E-4,"d":"0"},4.1000000000000265E-5,null,{"$f":"IF(U342>'JSM Eingabe+TW'!$CU$92,'JSM Eingabe+TW'!$CU$92,\" \")","v":" "},41]
[{"$nulls":18},40,326,{"$f":"LARGE('JSM Eingabe+TW'!$DJ$32:$DU$62,S343)","v":1e-06},0,0,{"v":1.830000000000012E-4,"d":"0"},4.0000000000000261E-5,null,{"$f":"IF(U343>'JSM Eingabe+TW'!$CU$92,'JSM Eingabe+TW'!$CU$92,\" \")","v":" "},40]
[{"$nulls":18},39,327,{"$f":"LARGE('JSM Eingabe+TW'!$DJ$32:$DU$62,S344)","v":1e-06},0,0,{"v":1.830000000000012E-4,"d":"0"},3.9000000000000257E-5,null,{"$f":"IF(U344>'JSM Eingabe+TW'!$CU$92,'JSM Eingabe+TW'!$CU$92,\" \")","v":" "},39]
[{"$nulls":18},38,328,{"$f":"LARGE('JSM Eingabe+TW'!$DJ$32:$DU$62,S345)","v":1e-06},0,0,{"v":1.830000000000012E-4,"d":"0"},3.8000000000000246E-5,{"$f":"P$34","v":0},{"$f":"IF(U345>'JSM Eingabe+TW'!$CU$92,'JSM Eingabe+TW'!$CU$92,\" \")","v":" "},38]
[{"$nulls":18},37,329,{"$f":"LARGE('JSM Eingabe+TW'!$DJ$32:$DU$62,S346)","v":1e-06},0,0,{"v":1.830000000000012E-4,"d":"0"},3.7000000000000242E-5,null,{"$f":"IF(U346>'JSM Eingabe+TW'!$CU$92,'JSM Eingabe+TW'!$CU$92,\" \")","v":" "},37]
[{"$nulls":18},36,330,{"$f":"LARGE('JSM Eingabe+TW'!$DJ$32:$DU$62,S347)","v":1e-06},0,0,{"v":1.830000000000012E-4,"d":"0"},3.6000000000000238E-5,null,{"$f":"IF(U347>'JSM Eingabe+TW'!$CU$92,'JSM Eingabe+TW'!$CU$92,\" \")","v":" "},36]
[{"$nulls":18},35,331,{"$f":"LARGE('JSM Eingabe+TW'!$DJ$32:$DU$62,S348)","v":1e-06},0,0,{"v":1.830000000000012E-4,"d":"0"},3.5000000000000227E-5,null,{"$f":"IF(U348>'JSM Eingabe+TW'!$CU$92,'JSM Eingabe+TW'!$CU$92,\" \")","v":" "},35]
[{"$nulls":18},34,332,{"$f":"LARGE('JSM Eingabe+TW'!$DJ$32:$DU$62,S349)","v":1e-06},0,0,{"v":1.830000000000012E-4,"d":"0"},3.4000000000000223E-5,null,{"$f":"IF(U349>'JSM Eingabe+TW'!$CU$92,'JSM Eingabe+TW'!$CU$92,\" \")","v":" "},34]
[{"$nulls":18},33,333,{"$f":"LARGE('JSM Eingabe+TW'!$DJ$32:$DU$62,S350)","v":1e-06},0,0,{"v":1.830000000000012E-4,"d":"0"},3.3000000000000213E-5,{"$f":"P$34","v":0},{"$f":"IF(U350>'JSM Eingabe+TW'!$CU$92,'JSM Eingabe+TW'!$CU$92,\" \")","v":" "},33]
[{"$nulls":18},32,334,{"$f":"LARGE('JSM Eingabe+TW'!$DJ$32:$DU$62,S351)","v":1e-06},0,0,{"v":1.830000000000012E-4,"d":"0"},3.2000000000000209E-5,null,{"$f":"IF(U351>'JSM Eingabe+TW'!$CU$92,'JSM Eingabe+TW'!$CU$92,\" \")","v":" "},32]
[{"$nulls":18},31,335,{"$f":"LARGE('JSM Eingabe+TW'!$DJ$32:$DU$62,S352)","v":1e-06},0,0,{"v":1.830000000000012E-4,"d":"0"},3.1000000000000205E-5,null,{"$f":"IF(U352>'JSM Eingabe+TW'!$CU$92,'JSM Eingabe+TW'!$CU$92,\" \")","v":" "},31]
[{"$nulls":18},30,336,{"$f":"LARGE('JSM Eingabe+TW'!$DJ$32:$DU$62,S353)","v":1e-06},0,0,{"v":1.830000000000012E-4,"d":"0"},3.0000000000000194E-5,null,{"$f":"IF(U353>'JSM Eingabe+TW'!$CU$92,'JSM Eingabe+TW'!$CU$92,\" \")","v":" "},30]
[{"$nulls":18},29,337,{"$f":"LARGE('JSM Eingabe+TW'!$DJ$32:$DU$62,S354)","v":1e-06},0,0,{"v":1.830000000000012E-4,"d":"0"},2.900000000000019E-5,null,{"$f":"IF(U354>'JSM Eingabe+TW'!$CU$92,'JSM Eingabe+TW'!$CU$92,\" \")","v":" "},29]
[{"$nulls":18},28,338,{"$f":"LARGE('JSM Eingabe+TW'!$DJ$32:$DU$62,S355)","v":1e-06},0,0,{"v":1.830000000000012E-4,"d":"0"},2.8000000000000183E-5,{"$f":"P$34","v":0},{"$f":"IF(U355>'JSM Eingabe+TW'!$CU$92,'JSM Eingabe+TW'!$CU$92,\" \")","v":" "},28]
[{"$nulls":18},27,339,{"$f":"LARGE('JSM Eingabe+TW'!$DJ$32:$DU$62,S356)","v":1e-06},0,0,{"v":1.830000000000012E-4,"d":"0"},2.7000000000000175E-5,null,{"$f":"IF(U356>'JSM Eingabe+TW'!$CU$92,'JSM Eingabe+TW'!$CU$92,\" \")","v":" "},27]
[{"$nulls":18},26,340,{"$f":"LARGE('JSM Eingabe+TW'!$DJ$32:$DU$62,S357)","v":1e-06},0,0,{"v":1.830000000000012E-4,"d":"0"},2.6000000000000171E-5,null,{"$f":"IF(U357>'JSM Eingabe+TW'!$CU$92,'JSM Eingabe+TW'!$CU$92,\" \")","v":" "},26]
[{"$nulls":18},25,341,{"$f":"LARGE('JSM Eingabe+TW'!$DJ$32:$DU$62,S358)","v":1e-06},0,0,{"v":1.830000000000012E-4,"d":"0"},2.5000000000000164E-5,null,{"$f":"IF(U358>'JSM Eingabe+TW'!$CU$92,'JSM Eingabe+TW'!$CU$92,\" \")","v":" "},25]
[{"$nulls":18},24,342,{"$f":"LARGE('JSM Eingabe+TW'!$DJ$32:$DU$62,S359)","v":1e-06},0,0,{"v":1.830000000000012E-4,"d":"0"},2.4000000000000156E-5,null,{"$f":"IF(U359>'JSM Eingabe+TW'!$CU$92,'JSM Eingabe+TW'!$CU$92,\" \")","v":" "},24]
[{"$nulls":18},23,343,{"$f":"LARGE('JSM Eingabe+TW'!$DJ$32:$DU$62,S360)","v":1e-06},0,0,{"v":1.830000000000012E-4,"d":"0"},2.3000000000000149E-5,{"$f":"P$34","v":0},{"$f":"IF(U360>'JSM Eingabe+TW'!$CU$92,'JSM Eingabe+TW'!$CU$92,\" \")","v":" "},23]
[{"$nulls":18},22,344,{"$f":"LARGE('JSM Eingabe+TW'!$DJ$32:$DU$62,S361)","v":1e-06},0,0,{"v":1.830000000000012E-4,"d":"0"},2.2000000000000142E-5,null,{"$f":"IF(U361>'JSM Eingabe+TW'!$CU$92,'JSM Eingabe+TW'!$CU$92,\" \")","v":" "},22]
[{"$nulls":18},21,345,{"$f":"LARGE('JSM Eingabe+TW'!$DJ$32:$DU$62,S362)","v":1e-06},0,0,{"v":1.830000000000012E-4,"d":"0"},2.1000000000000138E-5,null,{"$f":"IF(U362>'JSM Eingabe+TW'!$CU$92,'JSM Eingabe+TW'!$CU$92,\" \")","v":" "},21]
[{"$nulls":18},20,346,{"$f":"LARGE('JSM Eingabe+TW'!$DJ$32:$DU$62,S363)","v":1e-06},0,0,{"v":1.830000000000012E-4,"d":"0"},2.000000000000013E-5,null,{"$f":"IF(U363>'JSM Eingabe+TW'!$CU$92,'JSM Eingabe+TW'!$CU$92,\" \")","v":" "},20]
[{"$nulls":18},19,347,{"$f":"LARGE('JSM Eingabe+TW'!$DJ$32:$DU$62,S364)","v":1e-06},0,0,{"v":1.830000000000012E-4,"d":"0"},1.9000000000000123E-5,null,{"$f":"IF(U364>'JSM Eingabe+TW'!$CU$92,'JSM Eingabe+TW'!$CU$92,\" \")","v":" "},19]
[{"$nulls":18},18,348,{"$f":"LARGE('JSM Eingabe+TW'!$DJ$32:$DU$62,S365)","v":1e-06},0,0,{"v":1.830000000000012E-4,"d":"0"},1.8000000000000119E-5,{"$f":"P$34","v":0},{"$f":"IF(U365>'JSM Eingabe+TW'!$CU$92,'JSM Eingabe+TW'!$CU$92,\" \")","v":" "},18]
[{"$nulls":18},17,349,{"$f":"LARGE('JSM Eingabe+TW'!$DJ$32:$DU$62,S366)","v":1e-06},0,0,{"v":1.830000000000012E-4,"d":"0"},1.7000000000000112E-5,null,{"$f":"IF(U366>'JSM Eingabe+TW'!$CU$92,'JSM Eingabe+TW'!$CU$92,\" \")","v":" "},17]
[{"$nulls":18},16,350,{"$f":"LARGE('JSM Eingabe+TW'!$DJ$32:$DU$62,S367)","v":1e-06},0,0,{"v":1.830000000000012E-4,"d":"0"},1.6000000000000104E-5,null,{"$f":"IF(U367>'JSM Eingabe+TW'!$CU$92,'JSM Eingabe+TW'!$CU$92,\" \")","v":" "},16]
[{"$nulls":18},15,351,{"$f":"LARGE('JSM Eingabe+TW'!$DJ$32:$DU$62,S368)","v":1e-06},0,0,{"v":1.830000000000012E-4,"d":"0"},1.5000000000000097E-5,null,{"$f":"IF(U368>'JSM Eingabe+TW'!$CU$92,'JSM Eingabe+TW'!$CU$92,\" \")","v":" "},15]
[{"$nulls":18},14,352,{"$f":"LARGE('JSM Eingabe+TW'!$DJ$32:$DU$62,S369)","v":1e-06},0,0,{"v":1.830000000000012E-4,"d":"0"},1.4000000000000091E-5,null,{"$f":"IF(U369>'JSM Eingabe+TW'!$CU$92,'JSM Eingabe+TW'!$CU$92,\" \")","v":" "},14]
[{"$nulls":18},13,353,{"$f":"LARGE('JSM Eingabe+TW'!$DJ$32:$DU$62,S370)","v":1e-06},0,0,{"v":1.830000000000012E-4,"d":"0"},1.3000000000000086E-5,{"$f":"P$34","v":0},{"$f":"IF(U370>'JSM Eingabe+TW'!$CU$92,'JSM Eingabe+TW'!$CU$92,\" \")","v":" "},13]
[{"$nulls":18},12,354,{"$f":"LARGE('JSM Eingabe+TW'!$DJ$32:$DU$62,S371)","v":1e-06},0,0,{"v":1.830000000000012E-4,"d":"0"},1.2000000000000078E-5,null,{"$f":"IF(U371>'JSM Eingabe+TW'!$CU$92,'JSM Eingabe+TW'!$CU$92,\" \")","v":" "},12]
[{"$nulls":18},11,355,{"$f":"LARGE('JSM Eingabe+TW'!$DJ$32:$DU$62,S372)","v":1e-06},0,0,{"v":1.830000000000012E-4,"d":"0"},1.1000000000000071E-5,null,{"$f":"IF(U372>'JSM Eingabe+TW'!$CU$92,'JSM Eingabe+TW'!$CU$92,\" \")","v":" "},11]
[{"$nulls":18},10,356,{"$f":"LARGE('JSM Eingabe+TW'!$DJ$32:$DU$62,S373)","v":1e-06},0,0,{"v":1.830000000000012E-4,"d":"0"},1.0000000000000065E-5,null,{"$f":"IF(U373>'JSM Eingabe+TW'!$CU$92,'JSM Eingabe+TW'!$CU$92,\" \")","v":" "},10]
[{"$nulls":18},9,357,{"$f":"LARGE('JSM Eingabe+TW'!$DJ$32:$DU$62,S374)","v":1e-06},0,0,{"v":1.830000000000012E-4,"d":"0"},9.00000000000006e-06,null,{"$f":"IF(U374>'JSM Eingabe+TW'!$CU$92,'JSM Eingabe+TW'!$CU$92,\" \")","v":" "},9]
[{"$nulls":18},8,358,{"$f":"LARGE('JSM Eingabe+TW'!$DJ$32:$DU$62,S375)","v":1e-06},0,0,{"v":1.830000000000012E-4,"d":"0"},8.0000000000000522E-6,{"$f":"P$34","v":0},{"$f":"IF(U375>'JSM Eingabe+TW'!$CU$92,'JSM Eingabe+TW'!$CU$92,\" \")","v":" "},8]
[{"$nulls":18},7,359,{"$f":"LARGE('JSM Eingabe+TW'!$DJ$32:$DU$62,S376)","v":1e-06},0,0,{"v":1.830000000000012E-4,"d":"0"},7.0000000000000456E-6,null,{"$f":"IF(U376>'JSM Eingabe+TW'!$CU$92,'JSM Eingabe+TW'!$CU$92,\" \")","v":" "},7]
[{"$nulls":18},6,360,{"$f":"LARGE('JSM Eingabe+TW'!$DJ$32:$DU$62,S377)","v":1e-06},0,0,{"v":1.830000000000012E-4,"d":"0"},6.0000000000000391E-6,null,{"$f":"IF(U377>'JSM Eingabe+TW'!$CU$92,'JSM Eingabe+TW'!$CU$92,\" \")","v":" "},6]
[{"$nulls":18},5,361,{"$f":"LARGE('JSM Eingabe+TW'!$DJ$32:$DU$62,S378)","v":1e-06},0,0,{"v":1.830000000000012E-4,"d":"0"},5.0000000000000326E-6,null,{"$f":"IF(U378>'JSM Eingabe+TW'!$CU$92,'JSM Eingabe+TW'!$CU$92,\" \")","v":" "},5]
[{"$nulls":18},4,362,{"$f":"LARGE('JSM Eingabe+TW'!$DJ$32:$DU$62,S379)","v":1e-06},0,0,{"v":1.830000000000012E-4,"d":"0"},4.0000000000000261E-6,null,{"$f":"IF(U379>'JSM Eingabe+TW'!$CU$92,'JSM Eingabe+TW'!$CU$92,\" \")","v":" "},4]
[{"$nulls":18},3,363,{"$f":"LARGE('JSM Eingabe+TW'!$DJ$32:$DU$62,S380)","v":1e-06},0,0,{"v":1.830000000000012E-4,"d":"0"},3.0000000000000196E-6,{"$f":"P$34","v":0},{"$f":"IF(U380>'JSM Eingabe+TW'!$CU$92,'JSM Eingabe+TW'!$CU$92,\" \")","v":" "},3]
[{"$nulls":18},2,364,{"$f":"LARGE('JSM Eingabe+TW'!$DJ$32:$DU$62,S381)","v":1e-06},0,0,{"v":1.830000000000012E-4,"d":"0"},2.000000000000013E-6,null,{"$f":"IF(U381>'JSM Eingabe+TW'!$CU$92,'JSM Eingabe+TW'!$CU$92,\" \")","v":" "},2]
[{"$nulls":18},1,365,{"$f":"LARGE('JSM Eingabe+TW'!$DJ$32:$DU$62,S382)","v":1e-06},0,0,{"v":1.830000000000012E-4,"d":"0"},1.0000000000000065E-6,null,{"$f":"IF(U382>'JSM Eingabe+TW'!$CU$92,'JSM Eingabe+TW'!$CU$92,\" \")","v":" "},1]
[]
[]
[{"$nulls":20},{"$f":"SUM(U20:U382)","v":{"v":3.6300000000000232E-4,"d":"0"}}]

{"sheet":"JSM Fremdwasser","index":15,"n_rows":101,"n_cols":18,"rows_kept":101,"merged":[[14,5,14,6],[15,5,16,6],[15,7,16,7],[15,8,16,15],[16,1,18,2],[17,5,17,6],[18,5,18,6],[18,8,18,15],[22,4,22,15],[25,2,25,3],[26,1,27,1],[26,2,27,3],[26,4,27,4],[26,5,27,5],[26,6,27,6],[26,7,27,7],[26,8,27,8],[26,9,27,9],[26,10,27,10],[26,11,27,11],[26,12,27,12],[26,13,27,13],[26,14,27,14],[26,15,27,15],[26,16,27,16],[28,2,28,3],[29,2,29,3],[30,2,30,3],[31,2,31,3],[32,2,32,3],[34,2,34,3],[36,9,37,11],[36,12,37,12],[36,13,37,14],[36,15,37,15],[39,8,41,15],[44,9,45,14],[44,15,45,15],[47,1,49,15],[57,4,57,6]]}
[]
[null,{"$f":"'JSM Eingabe+TW'!B2","v":"Ergebnisse der Selbstüberwachung"},{"$nulls":12},"Berichtsjahr :",{"$f":"IF(LEN('JSM Eingabe+TW'!AB7)>0,'JSM Eingabe+TW'!AB7,\"\")","v":""}]
[]
[]
[null,{"$f":"'JSM Eingabe+TW'!B5","v":"Ermittlung der Jahresschmutzwassermenge (JSM) und des Fremdwassers (QF)"},{"$nulls":13},"Blatt 5"]
[]
[{"$nulls":3},"Kläranlage :",{"$f":"IF(LEN('JSM Eingabe+TW'!D7)>0,'JSM Eingabe+TW'!D7,\"\")","v":""},{"$nulls":4},"VG / Stadt:  ",{"$f":"IF(LEN('JSM Eingabe+TW'!M7)>0,'JSM Eingabe+TW'!M7,\"\")","v":""},{"$nulls":4},{"$f":"'JSM Eingabe+TW'!AB2","v":"Programmversion 7.3.9"}]
[]
[null,"Fremdwasserermittlung über Messung"]
[]
[]
[]
[null,"über Fremdwassermessungen:",{"$nulls":3},"Abzug für geschätzten Nachtzufluss der angeschlossenen Einwohner (Ez)"]
[{"$nulls":5}," "]
[{"$nulls":3},"Aktuell angeschlossene Einwohner EZ:",{"$f":"'JSM Eingabe+TW'!K12","v":0},"bei  EZ",null,"wird q ="]
[{"$nulls":5},"< 5.000 E",null,0.3,"Gleichförmiges Kanalnetz ohne Einrichtungen , die zu einer deutlichen Verlängerung der tatsächlichen Fließzeiten bei TW führen"]
[null,"INFO"]
[{"$nulls":5},"5.000 - 100.000 E",null,0.5]
[{"$nulls":3},"q  gewählt = ",{"$f":"IF($E$15<5000,$H$16,IF($E$15<=100000,$H$18,IF($E$15>100000,$H$19)))","v":0.3},"> 100.000 E",null,1,"Großes Kanalnetz oder Fließzeiten bei TW von mehr als 10 Std."]
[]
[{"$nulls":15},"Die Ermittlung erfolgt bei Trockenwetter anhand des geringsten Durchflusses (z.B. Nachtmessungen gegen 3 Uhr) und Messungen des Tageswasserabflusses über 24 Stunden (Zählwerksablesung)."]
[]
[{"$nulls":4},"Datum der Fremdwasserbestimmung"]
[]
[]
[null,"A","gemessener geringster Nachtzufluss   [ l/s  ]"]
[null,"B","Abzug für geschätzten Nachtzufluss der angeschlossenen Einwohner (EZ):      q * EZ / 1000   [ l/s ]",null,{"$f":"$E$19*$E$15/1000","v":{"v":0,"d":"0.00"}},{"v":0,"d":"0.00"},{"v":0,"d":"0.00"},{"v":0,"d":"0.00"},{"v":0,"d":"0.00"},{"v":0,"d":"0.00"},{"v":0,"d":"0.00"},{"v":0,"d":"0.00"},{"v":0,"d":"0.00"},{"v":0,"d":"0.00"},{"v":0,"d":"0.00"},{"v":0,"d":"0.00"}]
[]
[null,"C","Abzug geschätzter Nachtzufluss aus Industrie  [ l/s ]"]
[null,"D","Fremdwasserzufluss  A - B - C    [ l/s ]",null,{"$f":"E26-E27-E29","v":{"v":0,"d":"0.00"}},{"v":0,"d":"0.00"},{"v":0,"d":"0.00"},{"v":0,"d":"0.00"},{"v":0,"d":"0.00"},{"v":0,"d":"0.00"},{"v":0,"d":"0.00"},{"v":0,"d":"0.00"},{"v":0,"d":"0.00"},{"$f":"N26-N27-N29","v":{"v":0,"d":"0.00"}},{"$f":"O26-O27-O29","v":{"v":0,"d":"0.00"}},{"v":0,"d":"0.00"},null,"Summen"]
[null,"E","Tagesfremdwasserzufluss D * 86,4      [m³/d]",null,{"$f":"IF(E26=\"\",0,IF(E26=0,0,E30*86.4))","v":0},{"$f":"IF(F26=\"\",0,IF(F26=0,0,F30*86.4))","v":0},0,0,0,0,0,0,0,{"$f":"IF(N26=\"\",0,IF(N26=0,0,N30*86.4))","v":0},{"$f":"IF(O26=\"\",0,IF(O26=0,0,O30*86.4))","v":0},0,null,{"$f":"SUMIF(E31:P31,\">0\")","v":0}]
[null,"F","gemessener Tagesabwasserzufluss (24 h bei Trockenwetter) einschl. FW    [ m³/d ]",{"$nulls":14},{"$f":"SUMIF(E32:P32,\">0\")","v":0}]
[null,"G","Tagesschmutzwasserabfluss  F - E   [ m³ /d ]",null,{"$f":"IF(E32=0,0,E32-E31)","v":0},0,0,0,0,0,0,0,0,{"$f":"IF(N32=0,0,N32-N31)","v":0},{"$f":"IF(O32=0,0,O32-O31)","v":0},{"$f":"IF(P32=0,0,P32-P31)","v":0},null," "]
[]
[null,"H","Fremdwasseranteil  100 * E / F",null,{"$f":"IF(E32=0,0,E31/E32)","v":{"v":0,"d":"0%"}},{"v":0,"d":"0%"},{"v":0,"d":"0%"},{"v":0,"d":"0%"},{"v":0,"d":"0%"},{"v":0,"d":"0%"},{"v":0,"d":"0%"},{"v":0,"d":"0%"},{"v":0,"d":"0%"},{"v":0,"d":"0%"},{"v":0,"d":"0%"},{"v":0,"d":"0%"},null,{"$f":"COUNTIF(E35:P35,\">0\")","v":0}]
[]
[{"$nulls":9},"Mittlerer Fremdwasseranteil aus",null,null,{"$f":"COUNTIF(E35:P35,\">0\")","v":0},"Messungen:    ",null,{"$f":"IF(M37=0,0,R31/R32)","v":{"v":0,"d":"0%"}}]
[]
[null,"über den Zulauf- CSB:"]
[{"$nulls":3},"Wasserverbrauch je EZ / EW  und Jahr",{"$f":"IF('JSM Eingabe+TW'!K12=0,\" \",'JSM Eingabe+TW'!S18/'JSM Eingabe+TW'!K12)","v":" "},"cbm/(E*a)  ",null,null,{"$f":"IF('JSM Eingabe+TW'!F23=\" \",\"Bei Anlagen ohne automatische Durchflussmengenmessung ist hier die Angabe des arithmetischen Mittels der CSB-Trockenwetterzulaufkonzentration des betreffenden Jahres unbedingt erforderlich\",IF(P37=0,\"Wegen fehlender Fremdwasserbestimmung ist die Angabe der CSB-Trockenwetterzulaufkonzentration (Jahresmittel) erforderlich\",\"Die CSB-Trockenwetter-Zulaufkonzentration nur dann angeben, wenn hierdurch ein sichereres Ergebnis als nach dem Meßprotokoll erzielt wird. Der höhere Wert wird übernommen.\"))","v":"Wegen fehlender Fremdwasserbestimmung ist die Angabe der CSB-Trockenwetterzulaufkonzentration (Jahresmittel) erforderlich"}]
[{"$nulls":3},"Wasserverbrauch je EZ / EW im Jahresmittel",{"$f":"IF(E40=\" \",\" \",E40*1000/365)","v":" "},"l/(E*d)"]
[{"$nulls":3},"CSB- Fracht im Rohabwasser im Jahresmittel",120,"g/(E*d)"]
[{"$nulls":3},"CSB- Konzentration bei 0 % Fremdwasser",{"$f":"IF(E41=0,\" \",IF(E41=\" \",\" \",E42/E41*1000))","v":" "},"mg/l",{"$nulls":7},"CSB-Trockenwetterzulaufkonzentration im Jahresmittel:",{"$f":"E43","v":" "},"  mg/l",null," "]
[]
[{"$nulls":9},"Fremdwasseranteil über Jahresmittel der CSB- TW- Konzentration:",{"$nulls":5},{"$f":"IF(E43=\" \",\" \",(100-O43*100/E43)/100)","v":" "}]
[null,"Bemerkungen:"]
[]
[null,"Der CSB - Mittelwert bei Trockenwetter (Wetterschlüssel 1+2) beträgt ??? mg/l und besteht aus ?? Werten.; "]
{"$rows_empty":52}
[null,"Quelle: LU Baden-Württemberg, Heft \"Fremdwasser in kommunalen Kläranlagen\" August 2006"]

{"sheet":"JSM Ergebnis","index":16,"n_rows":119,"n_cols":23,"rows_kept":119,"merged":[[1,19,1,20],[6,5,6,7],[6,9,6,16],[12,8,12,11],[12,12,13,12],[12,13,12,14],[14,2,14,5],[15,2,15,4],[18,2,18,4],[31,12,31,20],[34,8,34,10],[38,2,39,19],[42,9,42,11],[43,9,43,11],[44,9,44,11],[44,18,44,19],[45,9,45,11],[45,18,45,19],[46,9,46,11],[47,9,47,11],[48,2,49,19],[53,2,53,19],[54,5,54,11],[55,15,55,19],[66,3,66,7],[70,2,70,4],[70,13,70,19],[71,2,71,3],[71,13,71,19],[87,3,89,6],[93,9,93,10],[94,9,94,10],[95,9,95,10],[96,9,96,10],[97,9,97,10],[98,4,98,6],[111,9,111,10],[116,6,116,9]]}
[]
[null,{"$f":"'JSM Eingabe+TW'!B2","v":"Ergebnisse der Selbstüberwachung"},{"$nulls":16},"Berichtsjahr :",{"$f":"IF(OR('JSM Eingabe+TW'!AB7=\"\",'JSM Eingabe+TW'!AB7=0),\"\",'JSM Eingabe+TW'!AB7)","v":""}]
[]
[]
[null,{"$f":"'JSM Eingabe+TW'!B5","v":"Ermittlung der Jahresschmutzwassermenge (JSM) und des Fremdwassers (QF)"},{"$nulls":18},"Blatt 6"]
[]
[{"$nulls":3},"Kläranlage :",null,{"$f":"'JSM Fremdwasser'!E7","v":""},null,null,"VG / Stadt:  ",{"$f":"'JSM Fremdwasser'!K7","v":""},{"$nulls":10},{"$f":"'JSM Fremdwasser'!P7","v":"Programmversion 7.3.9"}]
[]
[null,"Zusammenfassung der Berechnungsergebnisse"]
[]
[]
[]
[null," ","JSM nach den Verfahren:",{"$nulls":4},"JSM","   Fremdwasseranteil im kommunalen Netz",{"$nulls":3},"Wichtung","Bemerkungen"]
[null,null,{"$f":"'JSM Eingabe+TW'!E92","v":"Achtung, statistische Verfahren können wegen zu wenigen Daten nicht gewertet werden!"},{"$nulls":4},"m3","m3",null,null," %"]
[null,null,{"$f":"'JSM Eingabe+TW'!E90","v":"weniger als die Hälfte an Trockenwettertagen ! "},{"$nulls":3},"Dichtemittel",{"$f":"IF(C14=\" \",IF('JSM Dichtemittel '!N28=\"x\",'JSM Dichtemittel '!Q28,IF('JSM Dichtemittel '!N36=\"x\",'JSM Dichtemittel '!Q36,IF('JSM Dichtemittel '!N41=\"x\",'JSM Dichtemittel '!Q41))),0)","v":0},{"$f":"IF(H15=0,0,H15-H$28)","v":0},null,null,{"$f":"IF(H15=0,0,I15/H15)","v":{"v":0,"d":"0%"}},{"$f":"IF('JSM Eingabe+TW'!F18=\"X\",0,IF(H15=0,0,IF(C15=\"weniger als die Hälfte an Trockenwettertagen ! \",0,1)))","v":0},{"$f":"IF('JSM Eingabe+TW'!AF65<48,\"   Verfahren wegen zu wenigen Daten nicht anwendbar\",IF(C15=\"weniger als die Hälfte an Trockenwettertagen ! \",\"   Weniger als die Hälfte an TW- Tagen. Verfahren nur bedingt anwendbar\",\" \"))","v":"   Verfahren wegen zu wenigen Daten nicht anwendbar"}]
[{"$nulls":6},"Jahresdauerlinie",{"$f":"IF(C14=\" \",IF('JSM Jahresdauerlinie'!E29=0,0,'JSM Jahresdauerlinie'!N34),0)","v":0},{"$f":"IF(H16=0,0,H16-H$28)","v":0},null,null,{"$f":"IF(H16=0,0,I16/H16)","v":{"v":0,"d":"0%"}},{"$f":"IF('JSM Eingabe+TW'!F18=\"X\",0,IF('JSM Eingabe+TW'!AF$65<48,0,IF(H16=0,0,1)))","v":0},{"$f":"IF('JSM Eingabe+TW'!AF65<48,\"   Verfahren wegen zu wenigen Daten nicht anwendbar\",\" \")","v":"   Verfahren wegen zu wenigen Daten nicht anwendbar"}]
[{"$nulls":6},"Dreiecksmethode",{"$f":"'JSM FW Dreieck'!N37","v":{"v":0.06679500000000044,"d":"0"}},{"$f":"'JSM FW Dreieck'!N35:N35","v":{"v":0.06679500000000044,"d":"0"}},null,null,{"$f":"IF(H17<0.1,0,'JSM FW Dreieck'!N38/100)","v":{"v":0,"d":"0%"}},{"$f":"IF('JSM Eingabe+TW'!F18=\"X\",0,IF('JSM Eingabe+TW'!S12=0,0,IF('JSM Eingabe+TW'!AF$65<48,0,IF(H17=0,0,1))))","v":0},{"$f":"IF('JSM Eingabe+TW'!S12=0,\"   Verfahren wegen fehlender Angabe zum Wasserverbrauch nicht anwendbar\",IF('JSM Eingabe+TW'!AF65<48,\"   Verfahren wegen zu wenigen Daten nicht anwendbar\",\" \"))","v":"   Verfahren wegen fehlender Angabe zum Wasserverbrauch nicht anwendbar"}]
[{"$nulls":6},"gleitendes Minimum A 198",{"$f":"IF(C14=\" \",'JSM GM A198'!J53,0)","v":0},{"$f":"IF(H18<0.1,0,H18-H28)","v":0},null,null,{"$f":"IF(H18<0.1,0,I18/H18)","v":{"v":0,"d":"0%"}},{"$f":"IF('JSM Eingabe+TW'!F18=\"X\",0,IF('JSM Eingabe+TW'!AF65<48,0,1))","v":0},{"$f":"IF('JSM Eingabe+TW'!AF65<48,\"   Verfahren wegen zu wenigen Daten nicht anwendbar\",\" \")","v":"   Verfahren wegen zu wenigen Daten nicht anwendbar"}]
[null,null,{"$f":"'JSM Eingabe+TW'!AF91","v":"Das Ergebnis nach Wetterschlüssel hinterfragen. Es fehlen die Daten von mindestens einem Monat."},{"$nulls":3},"Anzahl der Trockenwettertage",{"$f":"IF(C14=\" \",IF('JSM Eingabe+TW'!AB64=0,0,'JSM Eingabe+TW'!AB72),0)","v":0},{"$f":"IF(H19=0,0,H19-H28)","v":0},null,null,{"$f":"IF(H19=0,0,I19/H19)","v":{"v":0,"d":"0%"}},{"$f":"IF('JSM Eingabe+TW'!F18=\"X\",0,IF('JSM Eingabe+TW'!AF65<48,0,IF(C19=\" \",1,\"0\")))","v":0},{"$f":"IF('JSM Eingabe+TW'!AF65<48,\"   Verfahren wegen zu wenigen Daten nicht anwendbar\",\" \")","v":"   Verfahren wegen zu wenigen Daten nicht anwendbar"}]
[{"$nulls":6},"Wasserverbrauch und Fremdwasser",{"$f":"IF(L20=0,0,100*H28/(100-L20*100))","v":0},{"$f":"IF(L20=0,0,H20-H28)","v":0},null,null,{"$f":"MAX('JSM Fremdwasser'!P$37,'JSM Fremdwasser'!P$45)","v":{"v":0,"d":"0%"}},{"$f":"IF('JSM Eingabe+TW'!F18=\"X\",0,IF('JSM Eingabe+TW'!S12=0,0,IF(H20=0,0,IF(SUM(M15:M19)>0,0,1))))","v":0},{"$f":"IF('JSM Eingabe+TW'!S12=0,\"   Trinkwasserverbrauch angeben!\",IF(SUM(M15:M19)+M21=0,\"   maßgebliches Verfahren!\"))","v":"   Trinkwasserverbrauch angeben!"}]
[{"$nulls":6},"gemessene Gesamtmenge (bei Trennsystem)",{"$f":"'JSM Eingabe+TW'!AB68","v":0},{"$f":"H21-H28","v":0},null,null,{"$f":"IF(H21=0,0,I21/H21)","v":{"v":0,"d":"0%"}},{"$f":"IF('JSM Eingabe+TW'!F18=\"X\",1,0)","v":0},{"$f":"IF(M21=1,\"    maßgebliches Verfahren\")","v":false}]
[]
[]
[]
[]
[null,null,"Trinkwasserverbrauch:"]
[{"$nulls":6},"kommunales Netz einschl. Eigenwasserversorgungen",{"$f":"'JSM Eingabe+TW'!S17","v":0},"m3/a"]
[{"$nulls":6},"um die Verluste reduziert",{"$f":"'JSM Eingabe+TW'!S18","v":0},"m3/a"]
[]
[]
[]
[{"$nulls":6},"Ergebnis der Bewertung:",{"$f":"IF(M21=1,H21,IF(M73=0,0,(H15*M15+H16*M16+H19*M19+H18*M18+H20*M20+H71*M71+H72*M72+H17*M17)/M73))","v":0},{"$f":"IF(H32=\" \",\" \",H32-H28)","v":0},null,null,{"$f":"IF(H32=0,0,I32/H32)","v":{"v":0,"d":"0%"}},{"$f":"IF(H28>H32,\"Es wird jedoch der um die Verluste reduzierte Wasserverbrauch maßgeblich!\",\" \")","v":" "},{"$nulls":9},{"$f":"H32","v":0}]
[]
[null,null,"Rundung:",{"$nulls":19},{"$f":"ROUND(W32/10,0)","v":0}]
[null,null,{"$f":"W46","v":1},null,null,"Jahresschmutzwassermenge für das Jahr ",{"$f":"T2","v":""},{"$f":"IF(H32=\" \",\" \",IF(H28>H32,H28,ROUNDUP(H32/C35,1)*C35))","v":0},"m³      einschließlich",null,null,{"$f":"IF(H35=0,0,(H35-H28)/H35)","v":{"v":0,"d":"0%"}},null,"Fremdwasser im Gesamtablauf",{"$nulls":8},{"$f":"ROUND(W34/10,0)","v":0}]
[{"$nulls":22},{"$f":"ROUND(W35/10,0)","v":0}]
[{"$nulls":22},0]
[null,null,"  Kommentar",{"$nulls":19},0]
[{"$nulls":22},0]
[{"$nulls":22},0]
[null,null," ",{"$nulls":19},0]
[null,null,"Fünfjahresüberprüfung der JSM    (nur auf dem jeweils letzten Blatt einer Fünfjahresüberprüfung durch die Wasserbehörde auszufüllen)",{"$nulls":19},0]
[{"$nulls":3},"Angeschlossene EZ:",{"$nulls":5},{"$f":"IF(OR(J46=\"\",J46=0),\"\",IF(OR('JSM Eingabe+TW'!K12=\"\",'JSM Eingabe+TW'!K12=0),\"EZ angeben!\",'JSM Eingabe+TW'!$K$12))","v":""}]
[{"$nulls":3},"Reduzierter Trinkwasserverbrauch:",{"$nulls":5},{"$f":"IF(OR(J47=\"\",J47=0),\"\",IF(OR('JSM Eingabe+TW'!S18=\"\",'JSM Eingabe+TW'!S18=0),\"Trinkw. angeben!\",'JSM Eingabe+TW'!S18))","v":""}]
[{"$nulls":3},"Jahr",null,{"$f":"IF(OR($J45=\"\",$J45=0),\"\",G45-1)","v":""},{"$f":"IF(OR($J45=\"\",$J45=0),\"\",H45-1)","v":""},{"$f":"IF(OR($J45=\"\",$J45=0),\"\",I45-1)","v":""},{"$f":"IF(OR($J45=\"\",$J45=0),\"\",J45-1)","v":""},{"$f":"IF(OR(T2=\"\",T2=0),\"\",T2)","v":""},{"$nulls":7},"JSM nach geltendem Bescheid :  ",{"$nulls":4},{"$f":"COUNTIF(W34:W42,\">1\")","v":0}]
[{"$nulls":3},"JSM (m³)",{"$nulls":5},{"$f":"H35","v":0},{"$nulls":7},"zu beantragende / festzusetzende JSM :  ",{"$nulls":4},{"$f":"1*10^W45","v":1}]
[{"$nulls":3},"JSM (m³/E)",null,{"$f":"IFERROR(IF(OR(F46=\"\",F46=0),0,F46/F43),\"\")","v":0},{"$f":"IFERROR(IF(OR(G46=\"\",G46=0),0,G46/G43),\"\")","v":0},{"$f":"IFERROR(IF(OR(H46=\"\",H46=0),0,H46/H43),\"\")","v":0},{"$f":"IFERROR(IF(OR(I46=\"\",I46=0),0,I46/I43),\"\")","v":0},{"$f":"IFERROR(IF(OR(J46=\"\",J46=0),0,IF('JSM Eingabe+TW'!K12=0,\"EZ angeben!\",J46/J43)),\"\")","v":0}]
[null,null,"Kommentar:","Reduzierter Trinkwasserverbrauch (m³/E)",null,{"$f":"IFERROR(IF(OR(F44=\"\",F44=0),0,F44/F43),\"\")","v":0},{"$f":"IFERROR(IF(OR(G44=\"\",G44=0),0,G44/G43),\"\")","v":0},{"$f":"IFERROR(IF(OR(H44=\"\",H44=0),0,H44/H43),\"\")","v":0},{"$f":"IFERROR(IF(OR(I44=\"\",I44=0),0,I44/I43),\"\")","v":0},{"$f":"IFERROR(IF(OR(J44=\"\",J44=0),0,J44/J43),\"\")","v":0}]
[]
[]
[]
[]
[]
[null,null,"Dieses Programm wurde durch den Fachbereich \"Abwasserwesen, Gewässergüte\" der Regionalstelle Wasserwirtschaft Abfallwirtschaft Bodenschutz bei der SGD Nord in Koblenz erstellt und wird als Hilfsmittel für die Ermittlung der JSM zur Verfügung gestellt. Es entbindet nicht von der fachkundigen Ausarbeitung und der Eigenverantwortung für die übermittelten Ergebnisse. Für die Richtigkeit des Programms wird keine Gewähr übernommen. Der Anwender erkennt durch Anwendung des Programms den Haftungsausschluss der SGD für die Folgen der Anwendung sowie für eventuell entstehende Schäden, auch an Hard- oder Software, ausdrücklich an. "]
[{"$nulls":5},"Autoren: Heidi Jung, Thomas Müller und Heinz-Peter Walgenbach, SGD Nord"]
{"$rows_empty":10}
[null,"Beide Zeilen markieren und aufziehen"]
[null,null,"EÜ-Berichte:","http://www3.chamaeleon.de/klaeranlagen/klaeranlagen.phtml",{"$nulls":4},"Kennwort:","mufko",null,null,"Passwort",null,null,"k1o2m36"]
[]
[{"$nulls":12},"Diese Wertungen werden im Endergebnis berücksichtigt,"]
[null,null,"weitere Vergleichsberechnungen:",{"$nulls":9},"sobald hier eine Zahl außer der 0 eingegeben wird."]
[null,null,{"$f":"'JSM Eingabe+TW'!AF91","v":"Das Ergebnis nach Wetterschlüssel hinterfragen. Es fehlen die Daten von mindestens einem Monat."},{"$nulls":3},"Wetterschlüssel ü. Monatssummen",{"$f":"IF(C14=\" \",IF('JSM Eingabe+TW'!AB64=0,0,'JSM Eingabe+TW'!AB98))","v":false},{"$f":"IF(H71=0,0,H71-H28)","v":0},null,null,{"$f":"IF(H71=0,0,I71/H71)","v":{"$error":"#DIV/0!"}},0]
[null,null,{"$f":"IF('JSM Eingabe+TW'!F23=\" \",\"bevorzugtes Ergebnis, da keine automatische Mengenmessung\",\"Wertung nicht erforderlich, da automatische Mengenmessung vorhanden\")","v":"Wertung nicht erforderlich, da automatische Mengenmessung vorhanden"},{"$nulls":3},"CSB im Zulauf (siehe das Folgende)",{"$f":"IF('JSM Fremdwasser'!E42=\" \",0,'JSM Ergebnis'!I112)","v":0},{"$f":"IF(H72=0,0,H72-H28)","v":0},null,null,{"$f":"IF(H72=0,0,I72/H72)","v":{"v":0,"d":"0.0%"}},0]
[{"$nulls":11},"Summe der Wichtungspunkte:",{"$f":"SUM(M15:M21)+M71+M72","v":0}]
[]
[]
[null,null,"Hilfswert:",{"$nulls":3},"Fremdwasser nach gleitendem Minimum",{"$f":"IF(C14=\" \",IF(H15=0,0,'JSM GM A198'!F53),0)","v":0},{"$f":"IF(H76=0,0,'JSM GM A198'!M53)","v":0},null,null,{"$f":"IF(H76=0,0,I76/H76)","v":{"v":0,"d":"0.0%"}}]
[]
[]
[]
[{"$nulls":3}," Abschätzung des Fremdwasseranteils über das arithmetische Mittel der CSB- Messwerte bei TW im Zulauf der KA"]
[{"$nulls":3},"Dieses Verfahren insbesondere dann anwenden, wenn keine automatische Durchflussmengenmesseinrichtung vorhanden ist."]
[{"$nulls":3},"1. Ermittlung der CSB- Konzentration"]
[{"$nulls":3}," -","nach theoretischem Ansatz:"]
[{"$nulls":6},"CSB- Konzentration im Rohabwasser","=",120,"g/(E*d)"]
[{"$nulls":6},"Wasserverbrauch je EZ / EW","=",150,"l/(E*d)"]
[{"$nulls":6},"CSB- Konzentration mit 0 % Fremdwasser","=",{"$f":"I84/I85*1000","v":800},"mg/l"]
[]
[{"$nulls":3},"Nach dem \"Leitfaden Abwasserabgabe\" der Landesanstalt für Umweltschutz Baden-Württemberg liegt ein Fremdwasser-anteil von 0 % vor bei einer CSB- Konzentration von"]
[]
[{"$nulls":7},"=",775,"mg/l"]
[]
[]
[{"$nulls":3}," -","nach tatsächlicher Belastung:",null,null,"(EZ)",null,"(EW)"]
[{"$nulls":7},{"$f":"'JSM Eingabe+TW'!K12","v":0},"E",1,null,"E"]
[{"$nulls":5},"Wasserverbrauch je EZ / EW  und Jahr","=",{"$f":"IF('JSM Eingabe+TW'!K12=0,0,'JSM Eingabe+TW'!S18/'JSM Eingabe+TW'!K12)","v":0},"cbm/(E*a)  ",{"$f":"IF(J94=0,0,'JSM Eingabe+TW'!S18/J94)","v":{"v":0,"d":"0.0"}},null,"cbm/(E*a)   "]
[{"$nulls":5},"Wasserverbrauch je EZ / EW im Jahresmittel","=",{"$f":"H95*1000/365","v":0},"l/(E*d)",{"$f":"J95*1000/365","v":0},null,"l/(E*d)"]
[{"$nulls":5},"CSB- Konzentration im Rohabwasser im Jahresmittel","=",{"$f":"I84","v":120},"g/(E*d)",100,null,"g/(E*d)"]
[{"$nulls":5},"CSB- Konzentration bei 0 % Fremdwasser","=",{"$f":"IF(H96=0,0,H97/H96*1000)","v":0},"mg/l",{"$f":"IF(J96=0,0,J97/J96*1000)","v":0},null,"mg/l"]
[]
[]
[{"$nulls":3},"2. Abschätzung des Fremdwasseranteils und der JSM:",{"$nulls":7},"  Hilfsweise das Mittel aus monatlichen Mittel- oder Maximalwerten gem. KOS"]
[{"$nulls":14},"Nebenrechnung:"]
[{"$nulls":5},"gewählte CSB- Konzentration mit 0 % Fremdwasser","=",null,{"$f":"(H98+J98)/2","v":0},"mg/l",{"$nulls":4},"monatliche Maximalwerte gem. KOS"]
[{"$nulls":5},"Angabe des Maßnahmeträgers","=",{"$nulls":7},350]
[{"$nulls":7},"Angabe Massnahmeträger:",{"$nulls":6},311]
[{"$nulls":5},"mittlerer CSB im Zulauf  bei TW","=",{"$f":"'JSM Fremdwasser'!O43","v":" "},{"$f":"H106","v":" "},"mg/l",{"$nulls":4},482]
[{"$nulls":5},"Fremdwasseranteil ","=",null,{"$f":"IF(I103=0,0,100-I106*100/I103)","v":{"v":0,"d":"0.0"}},"%",{"$nulls":4},384]
[{"$nulls":14},588]
[{"$nulls":5},"Reduzierter Frischwasserverbrauch","=",null,{"$f":"'JSM Eingabe+TW'!S18","v":0},"cbm",{"$nulls":4},471]
[{"$nulls":5},"Fremdwasser","=",null,{"$f":"IF(I106=0,\" \",I112-I109)","v":0},"cbm",{"$nulls":4},556]
[{"$nulls":14},399]
[{"$nulls":5},"JSM","=",null,{"$f":"IF(I106=0,\" \",100*I109/(100-I107))","v":0},"cbm",{"$nulls":4},543]
[{"$nulls":14},618]
[{"$nulls":5},"Indizien für einen erhöhten Fremdwasseranfall über 50 % sind"," -","CSB < 385 mg/l",{"$nulls":6},635]
[{"$nulls":6}," -","TNb < 38 mg/l",{"$nulls":6},600]
[{"$nulls":14},{"$f":"SUM(O104:O115)","v":5937}]
[{"$nulls":5},"Bemerkung:",{"$nulls":7},"mittl. max CCSB",{"$f":"O116/12","v":{"v":494.75,"d":"495"}},"mg/l"]
[]
[null,"Für weitere Kontrollberechungen die Zeilen 62-115  markieren und aufziehen (oder Doppelklick)",".",{"$nulls":17},"JSM"]